{"text_format":"1","workbook":"xlsx","n_sheets":9,"sheets":["handleiding gebruik","INVULBLAD","detail transfer","detail wasgebeuren","Overzichtsblad","tabel","grafiek","praktijkrichtlijn","zelfredzaamheid"],"not_rendered":{"charts":1,"images":39,"macros":1,"external_links":0,"defined_names":12,"comments":2,"pivot_tables":0},"unopened":[],"bounds":{"document_bytes":16777216,"sheet_cells":100000,"rows_first":2000,"rows_last":500,"rows_between":2000,"halvings":0,"cell_chars":16384,"cell_head_chars":4096},"cells_cut":0,"cells_raw":0,"read":"whole","date_system":"1900"}

{"sheet":"handleiding gebruik","index":0,"n_rows":96,"n_cols":4,"rows_kept":96,"cut":false,"hidden":false,"merged":[[100,2,100,3],[35,1,35,3],[8,2,8,3],[2,1,2,3],[4,1,4,3],[5,1,5,3],[38,1,38,3],[40,1,41,3],[47,2,47,3],[62,2,62,3]]}
["Inleiding"]
[]
[null,"De Vlaamse Tilthermometer 1.1  is een analyse tool ontwikkeld door VerV, werkgroep zorg, gebaseerd op de Nederlandse tilthermometer."]
[]
[null,"Doel is om in beeld te brengen wat de fysieke belasting kan betekenen voor de zorgverlener volgens type zorgvragers bij de analyse van een afdeling. "]
[null,"De parameters mobiliteitsklasse, aanwezige en gebruikte hulpmiddelen per transfer/activiteit zorgen voor bepaling van de zorgzwaarte en risicograad."]
[]
[]
[]
[]
[]
[]
[]
[]
[]
[]
[]
[]
[]
[]
[]
[]
[]
[]
[]
[]
[]
[]
[null,"De zorgzwaarte is een waarde die de graad van zorgzwaarte veroorzaakt door de fysische "]
[null,"belasting."]
[]
[null,"Bij een volgende meting kan deze waarde wijzigen waardoor de tendens tot toename of afname "]
[null,"van zorgzwaarte vastgesteld kan worden."]
[]
[null,"Reageren door aanpassing materialen en medewerkers  is het initialtief hierop om werkbelasting "]
[null,"haalbaar te houden."]
[]
[]
[null,"Belangrijk is om steeds de recentste versie te gebruiken. Deze staat altijd online op www.VerV.be. Deze is gratis te downloaden en zo kan u steeds werken met de juiste versie. "]
[]
[null,"Indien u problemen ervaart, vragen heeft, mail naar  info@verv.be"]
[]
["Handleiding gebruik"]
[]
["OPSLAAN BESTAND EN RESETTEN"]
[null,null,"Het is sterk aan te raden om het excel bestand op te staan met steeds een nieuwe naam."]
[]
[null,null,"Indien er slechts wijziging is van 1 of paar zorgvragers, dan kan elke kolom apart GERESET worden. U hoeft niet altijd alles herintevullen als aantal clienten dezelfde gebleven zijn. "]
[null,"WERKWIJZE RESET: via lint bovenaan"]
[null,null,"ga naar 'Beeld'"]
[null,null,"ga naar 'Macro's'"]
[null,null,"selecteer kolomnummer en voer uit, de kolom staat terug blanco."]
[]
["INVULBLAD"]
[null,"Het document is enkel in te vullen via het tabblad 'iINVULBLAD'. "]
[null,null,"Per kolom is de invulling per zorgvrager."]
[null,null,"Verschillende observaties kunnen ingevuld worden."]
[null,null,null,"Klasse: met uitklapmenu en keuze uit de 5 klassen (hierdoor worden automatisch aantal invullingen gedaan die beantwoorden aan de richtlijnen"]
[null,null,null,"BMI: lengte en gewicht in te vullen ( is facultatief, heeft geen invloed op verdere analyse in de tool)"]
[]
[null,null,null,"Type transfer/activiteit:  eerst kies je of deze activiteit aanwezig is, zo ja: er is automatische invulling volgens praktijkrichtlijn, wijkt deze af van de observatie: door venster open te klappen kan je wijzigen."]
[]
[null,null,"Let op: door keuze van een mobiliteitsklasse worden er aantal zaken direct ingevuld. Indien een bepaalde groep transfer niet van toepassing is, dan moet ook de bijhorende automatische ingevulde velden uitgeklikt worden via het uitklapvenster per cel. "]
[]
["OBSERVATIEBLADEN"]
[null,"Deze worden automatisch gevuld (de cellen  bij deze zijn niet wijzigbaar, tenzij vermeld)"]
[null,null,"Detail transfer:"]
[null,null,null,"Hier is er overzicht van de type transfers. Onderaan dit tabblad kan je uitzondererlijk de aanwezige hulpmiddelen op de afdeling invullen. (groene vakjes) Een berekening volgt tussen aanbod en noodzaak aantal."]
[]
[null,null,"Interpretatie overzichten onderaan blad 'detail transfer' en 'detail wasgebeuren'"]
[null,null,null,"Doe enkel interpretatie van positieve cijfers,"]
[null,null,null,"In gebruik: zijn de aantallen die effectief in gebruik zijn"]
[null,null,null,"Terecht nodig: zijn de aantallen die nodig zijn gebaseerd volgens praktijkrichtlijnen"]
[null,null,null,"Onterecht in gebruik: hierin kan er gedetecteerd worden dat er hulpmiddelen onterecht gebruikt worden volgens de richtlijnen. Aantal kunnen wel kloppen, bijv. hulpmiddel gebruikt bij te goede klasse en ontbreken van hulpmiddel bij klasse waar het nodig is. "]
[null,null,null,"Tekort: is aantal dat effectief tekort is, gebaseerd volgens mobiliteitsklassen. "]
[]
[null,null,"Detail wasgebeuren:"]
[null,null,null,"Hier is er een overzicht van het type wasgebeuren. Onderaan is er een globaal overzicht wasgebeuren."]
[]
[null,null,"Overzichtsblad:"]
[null,null,null,"In dit tabblad is er overzicht van de berekeningen per type transfer, per mobiliteitsklasse en volgt er een berekening van de zorgzwaarte."]
[null,null,null,"In de kleine blauwe kaders is mogelijkheid om instelling, afdeling, datum , ID invuller in te vullen."]
[]
[null,null,"Tabel: "]
[null,null,null,"De resultaten worden hier weergegeven in een overzichtstabel."]
[]
[null,null,"Grafiek:"]
[null,null,null,"De resultaten worden hier weergegeven in een grafiek, uitgesplitst hoeveel er OK zijn en hoeveel er NIET  OK zijn volgens de praktijkrichtlijnen."]
[]
["ACHTERGRONDINFORMATIE"]
[]
[null,null,"Praktijkrichtlijn:"]
[null,null,null,"Deze zijn gebaseerd op de ergonomische normen. Werkgroep zorg VerV ondersteunt deze richtlijnen."]
[]
[null,null,"Zelfredzaamheid:"]
[null,null,null,"Hier is er een opsooming van aantal tips naar zelfredzaamheid. "]

{"sheet":"INVULBLAD","index":1,"n_rows":36,"n_cols":54,"rows_kept":36,"cut":false,"hidden":false,"merged":[[18,0,19,0],[20,0,21,0],[22,0,23,0],[16,0,17,0]]}
["N Pt","Cliënt",1,2,3,4,5,6,7,8,9,10,11,12,13,14,15,16,17,18,19,20,21,22,23,24,25,26,27,28,29,30,31,32,33,34,35,36,37,38,39,40,41,42,43,44,45,46,47,48,49,50,51,"Opnieuw"]
[null,"Klasse","Vrij","Vrij","Vrij","Vrij","Vrij","Vrij","Vrij","Vrij","Vrij","Vrij","Vrij","Vrij","Vrij","Vrij","Vrij","Vrij","Vrij","Vrij","Vrij","Vrij","Vrij","Vrij","Vrij","Vrij","Vrij","Vrij","Vrij","Vrij","Vrij","Vrij","Vrij","Vrij","Vrij","Vrij","Vrij","Vrij","Vrij","Vrij","Vrij","Vrij","Vrij","Vrij","Vrij","Vrij","Vrij","Vrij","Vrij","Vrij","Vrij","Vrij","Vrij"]
["BMI","lengte (in meter)"]
[null,"gewicht (in kg)"]
[null,"BMI_berekening",{"$f":"IF(C3,C4/C3^2,\"\")","v":""},"","","","","","","","","","","","","","","","","","","","","","","","","","","","","","","","","","","","","","","","","","","","","","","","",{"$f":"IF(AZ3,AZ4/AZ3^2,\"\")","v":""},""]
["Verplaatsing bed naar bed (verbedden)","van toepassing",{"$f":"IF(OR(C$2=\"C\",C$2=\"D\",C$2=\"E\"),\"ja\",\"nee\")","v":"nee"},"nee","nee","nee","nee","nee","nee","nee","nee","nee","nee","nee","nee","nee","nee","nee","nee","nee","nee","nee","nee","nee","nee","nee","nee","nee","nee","nee","nee","nee","nee","nee","nee","nee","nee","nee","nee","nee","nee","nee","nee","nee","nee","nee","nee","nee","nee","nee","nee","nee","nee","doorvoeren"]
["(douche - brancard - behandeltafel)","gebruik hoog-laagsysteem",{"$f":"IF(C6=\"nee\",\"nee\",\"ja\")","v":"nee"},"nee","nee","nee","nee","nee","nee","nee","nee","nee","nee","nee","nee","nee","nee","nee","nee","nee","nee","nee","nee","nee","nee","nee","nee","nee","nee","nee","nee","nee","nee","nee","nee","nee","nee","nee","nee","nee","nee","nee","nee","nee","nee","nee","nee","nee","nee","nee",{"$f":"IF(AY6=\"nee\",\"nee\",\"ja\")","v":"nee"},{"$f":"IF(AZ6=\"nee\",\"nee\",\"ja\")","v":"nee"},"nee","doorvoeren"]
[null,"gebruik hulpmiddel",{"$f":"IF(C6=\"nee\",$C36,$C27)","v":"geen"},"geen","geen","geen","geen","geen","geen","geen","geen","geen","geen","geen","geen","geen","geen","geen","geen","geen","geen","geen","geen","geen","geen","geen","geen","geen","geen","geen","geen","geen","geen","geen","geen","geen","geen","geen","geen","geen","geen","geen","geen","geen","geen","geen","geen","geen","geen","geen","geen",{"$f":"IF(AZ6=\"nee\",$C36,$C27)","v":"geen"},{"$f":"IF(BA6=\"nee\",$C36,$C27)","v":"geen"},"doorvoeren"]
["Verplaatsing binnen bed ","van toepassing",{"$f":"IF(OR(C$2=\"C\",C$2=\"D\",C$2=\"E\"),\"ja\",\"nee\")","v":"nee"},"nee","nee","nee","nee","nee","nee","nee","nee","nee","nee","nee","nee","nee","nee","nee","nee","nee","nee","nee","nee","nee","nee","nee","nee","nee","nee","nee","nee","nee","nee","nee","nee","nee","nee","nee","nee","nee","nee","nee","nee","nee","nee","nee","nee","nee","nee","nee","nee","nee","nee","doorvoeren"]
[null,"hoog-laag bedden",{"$f":"IF(C9=\"nee\",\"nee\",\"ja\")","v":"nee"},"nee","nee","nee","nee","nee","nee","nee","nee","nee","nee","nee","nee","nee","nee","nee","nee","nee","nee","nee","nee","nee","nee","nee","nee","nee","nee","nee","nee","nee","nee","nee","nee","nee","nee","nee","nee","nee","nee","nee","nee","nee","nee","nee","nee","nee","nee","nee","nee",{"$f":"IF(AZ9=\"nee\",\"nee\",\"ja\")","v":"nee"},"nee","doorvoeren"]
[null,"gebruik hulpmiddel",{"$f":"IF(C9=\"nee\",$D28,$D27)","v":"geen"},"geen","geen","geen","geen","geen","geen","geen","geen","geen","geen","geen","geen","geen","geen","geen","geen","geen","geen","geen","geen","geen","geen","geen","geen","geen","geen","geen","geen","geen","geen","geen","geen","geen","geen","geen","geen","geen","geen","geen","geen","geen","geen","geen","geen","geen","geen","geen","geen",{"$f":"IF(AZ9=\"nee\",$D28,$D27)","v":"geen"},{"$f":"IF(BA9=\"nee\",$D28,$D27)","v":"geen"},"doorvoeren"]
["Van lig naar zit (opzetten,vb. bed->zetel)","van toepassing",{"$f":"IF(OR(C$2=\"C\",C$2=\"D\",C$2=\"E\"),\"ja\",\"nee\")","v":"nee"},"nee","nee","nee","nee","nee","nee","nee","nee","nee","nee","nee","nee","nee","nee","nee","nee","nee","nee","nee","nee","nee","nee","nee","nee","nee","nee","nee","nee","nee","nee","nee","nee","nee","nee","nee","nee","nee","nee","nee","nee","nee","nee","nee","nee","nee","nee","nee","nee","nee","nee","doorvoeren"]
[null,"gebruik stahulpmiddel ",{"$f":"IF(C12=\"ja\",$E27,$E32)","v":"geen"},"geen","geen","geen","geen","geen","geen","geen","geen","geen","geen","geen","geen","geen","geen","geen","geen","geen","geen","geen","geen","geen","geen","geen","geen","geen","geen","geen","geen","geen","geen","geen","geen","geen","geen","geen","geen","geen","geen","geen","geen","geen","geen","geen","geen","geen","geen","geen","geen",{"$f":"IF(AZ12=\"ja\",$E27,$E32)","v":"geen"},{"$f":"IF(BA12=\"ja\",$E27,$E32)","v":"geen"},"doorvoeren"]
[null,"gebruik lift",{"$f":"IF(OR(C2=\"D\",C2=\"E\"),$H27,$H29)","v":"geen"},"geen","geen","geen","geen","geen","geen","geen","geen","geen","geen","geen","geen","geen","geen","geen","geen","geen","geen","geen","geen","geen","geen","geen","geen","geen","geen","geen","geen","geen","geen","geen","geen","geen","geen","geen","geen","geen","geen","geen","geen","geen","geen","geen","geen","geen","geen","geen","geen",{"$f":"IF(OR(AZ2=\"D\",AZ2=\"E\"),$H27,$H29)","v":"geen"},{"$f":"IF(OR(BA2=\"D\",BA2=\"E\"),$H27,$H29)","v":"geen"},"doorvoeren"]
["van zit  naar sta en stappen","sta en stappen \nenkel B en C",{"$f":"IF(OR(C2=\"B\",C2=\"C\"),\"ja\",\"nee\")","v":"nee"},"nee","nee","nee","nee","nee","nee","nee","nee","nee","nee","nee","nee","nee","nee","nee","nee","nee","nee","nee","nee","nee","nee","nee","nee","nee","nee","nee","nee","nee","nee","nee","nee","nee","nee","nee","nee","nee","nee","nee","nee","nee","nee","nee","nee","nee","nee","nee","nee",{"$f":"IF(OR(AZ2=\"B\",AZ2=\"C\"),\"ja\",\"nee\")","v":"nee"},{"$f":"IF(OR(BA2=\"B\",BA2=\"C\"),\"ja\",\"nee\")","v":"nee"},"doorvoeren"]
[null,"sta-en staphulpmiddel",{"$f":"IF(C15=\"ja\",$F27,\"geen\")","v":"geen"},"geen","geen","geen","geen","geen","geen","geen","geen","geen","geen","geen","geen","geen","geen","geen","geen","geen","geen","geen","geen","geen","geen","geen","geen","geen","geen","geen","geen","geen","geen","geen","geen","geen","geen","geen","geen","geen","geen","geen","geen","geen","geen","geen","geen","geen","geen","geen","geen",{"$f":"IF(AZ15=\"ja\",$F27,\"geen\")","v":"geen"},{"$f":"IF(BA15=\"ja\",$F27,\"geen\")","v":"geen"},"doorvoeren"]
["steunkousen","steunkousen ","nee","nee","nee","nee","nee","nee","nee","nee","nee","nee","nee","nee","nee","nee","nee","nee","nee","nee","nee","nee","nee","nee","nee","nee","nee","nee","nee","nee","nee","nee","nee","nee","nee","nee","nee","nee","nee","nee","nee","nee","nee","nee","nee","nee","nee","nee","nee","nee","nee","nee","nee"]
[null,"hulpmiddel steunkousen",{"$f":"IF(C17=\"ja\",$G27,$G29)","v":"geen"},"geen","geen","geen","geen","geen","geen","geen","geen","geen","geen","geen","geen","geen","geen","geen","geen","geen","geen","geen","geen","geen","geen","geen","geen","geen","geen","geen","geen","geen","geen","geen","geen","geen","geen","geen","geen","geen","geen","geen","geen","geen","geen","geen","geen","geen","geen","geen","geen",{"$f":"IF(AZ17=\"ja\",$G27,$G29)","v":"geen"},{"$f":"IF(BA17=\"ja\",$G27,$G29)","v":"geen"},"doorvoeren"]
["zittend douchen/ wassen ","wassen/douchen zittende cliënt","nee","nee","nee","nee","nee","nee","nee","nee","nee","nee","nee","nee","nee","nee","nee","nee","nee","nee","nee","nee","nee","nee","nee","nee","nee","nee","nee","nee","nee","nee","nee","nee","nee","nee","nee","nee","nee","nee","nee","nee","nee","nee","nee","nee","nee","nee","nee","nee","nee","nee","nee"]
[null,"gebruik hoog-laag douchestoel",{"$f":"IF(C19=\"ja\",\"ja\",\"nee\")","v":"nee"},"nee","nee","nee","nee","nee","nee","nee","nee","nee","nee","nee","nee","nee","nee","nee","nee","nee","nee","nee","nee","nee","nee","nee","nee","nee","nee","nee","nee","nee","nee","nee","nee","nee","nee","nee","nee","nee","nee","nee","nee","nee","nee","nee","nee","nee","nee","nee",{"$f":"IF(AY19=\"ja\",\"ja\",\"nee\")","v":"nee"},{"$f":"IF(AZ19=\"ja\",\"ja\",\"nee\")","v":"nee"},"nee","doorvoeren"]
["liggend douchen","liggend douchen","nee","nee","nee","nee","nee","nee","nee","nee","nee","nee","nee","nee","nee","nee","nee","nee","nee","nee","nee","nee","nee","nee","nee","nee","nee","nee","nee","nee","nee","nee","nee","nee","nee","nee","nee","nee","nee","nee","nee","nee","nee","nee","nee","nee","nee","nee","nee","nee","nee","nee","nee"]
[null,"hoog-laag douchebrancard",{"$f":"IF(C21=\"ja\",\"ja\",\"nee\")","v":"nee"},"nee","nee","nee","nee","nee","nee","nee","nee","nee","nee","nee","nee","nee","nee","nee","nee","nee","nee","nee","nee","nee","nee","nee","nee","nee","nee","nee","nee","nee","nee","nee","nee","nee","nee","nee","nee","nee","nee","nee","nee","nee","nee","nee","nee","nee","nee","nee","nee",{"$f":"IF(AZ21=\"ja\",\"ja\",\"nee\")","v":"nee"},"nee","doorvoeren"]
["baden ","baden","nee","nee","nee","nee","nee","nee","nee","nee","nee","nee","nee","nee","nee","nee","nee","nee","nee","nee","nee","nee","nee","nee","nee","nee","nee","nee","nee","nee","nee","nee","nee","nee","nee","nee","nee","nee","nee","nee","nee","nee","nee","nee","nee","nee","nee","nee","nee","nee","nee","nee","nee"]
[null,"hoog-laag bad /badstoel",{"$f":"IF(C23=\"ja\",\"ja\",\"nee\")","v":"nee"},"nee","nee","nee","nee","nee","nee","nee","nee","nee","nee","nee","nee","nee","nee","nee","nee","nee","nee","nee","nee","nee","nee","nee","nee","nee","nee","nee","nee","nee","nee","nee","nee","nee","nee","nee","nee","nee","nee","nee","nee","nee","nee","nee","nee","nee","nee","nee","nee",{"$f":"IF(AZ23=\"ja\",\"ja\",\"nee\")","v":"nee"},"nee","doorvoeren"]
[null,"RESET","Shift+Ctrl+C","Shift+Ctrl+D","Shift+Ctrl+E","Macro:Reset04","Shift+Ctrl+G","Shift+Ctrl+H","Shift+Ctrl+I","Shift+Ctrl+J","Shift+Ctrl+K","Shift+Ctrl+L","Shift+Ctrl+M","Shift+Ctrl+N","Shift+Ctrl+O","Shift+Ctrl+P","Shift+Ctrl+Q","Shift+Ctrl+R","Shift+Ctrl+S","Shift+Ctrl+T","Shift+Ctrl+U","Shift+Ctrl+V","Shift+Ctrl+W","Shift+Ctrl+X","Shift+Ctrl+Y","Shift+Ctrl+Z","Shift+Ctrl+A","Shift+Ctrl+B","Macro:Reset27","Macro:Reset28","Option+Cmd+e","Macro:Reset30","Option+Cmd+g","Macro:Reset32","Macro:Reset33","Option+Cmd+j","Option+Cmd+k","Option+Cmd+l","Macro:Reset37","Option+Cmd+n","Macro:Reset39","Option+Cmd+p","Option+Cmd+q","Option+Cmd+r","Option+Cmd+s","Option+Cmd+t","Option+Cmd+u","Option+Cmd+v","Macro:Reset47","Option+Cmd+x","Option+Cmd+y","Option+Cmd+z"]
[null,"mobiliteitsklasse","bed naar bed","binnen bed","opzetten","sta- en stapmiddel","steunkousen","tillift"]
[null,"A","rolbord","glijzeil","actieve lift ","kruk","glijkous","passieve tillift","ja"]
[null,"B","glijplank","geen","opstastoel","looprek","beugel","plafondlift","nee"]
[null,"C","glijzeil","glijlaken","opstahulp","rollator","geen","geen"]
[null,"D","glijlaken","glijmat","draaischijf","wandelstok"]
[null,"E","zweefmatras","tilband","transfergordel","geen"]
[null,"Vrij","glijmat","tildoek","geen"]
[null,null,"passieve tillift"]
[null,null,"plafondlift"]
[null,null,"ministretcher"]
[null,null,"geen"]

{"sheet":"detail transfer","index":2,"n_rows":83,"n_cols":16,"rows_kept":83,"cut":false,"hidden":false,"merged":[[0,14,0,15],[0,5,0,7],[0,2,0,4],[0,8,0,10],[0,11,0,13],[78,15,79,15],[65,11,69,11],[65,7,73,7],[73,11,76,11],[65,15,69,15],[73,15,74,15]]}
["N Pt",null,"BMI",null,null,"Verplaatsing bed naar bed (verbedden)\n(douche - brancard - behandeltafel)",null,null,"Verplaatsing binnen bed",null,null,"Van lig naar zit ( opzetten)",null,null,"van zit naar sta en stappen"]
["Cliënt","Klasse","lengte (in meter)","gewicht (in kg)","BMI_berekening","van toepassing","gebruik hoog-laagsysteem","gebruik hulpmiddel","van toepassing","hoog-laag bedden","gebruik hulpmiddel","van toepassing","gebruik stahulpmiddel","gebruik passieve lift","sta en stappen \nenkel B en C","hulpmiddel voor sta en stappen"]
[{"$f":"INVULBLAD!$C1","v":1},{"$f":"INVULBLAD!$C2","v":"Vrij"},{"$f":"INVULBLAD!$C3","v":0},{"$f":"INVULBLAD!$C4","v":0},{"$f":"INVULBLAD!$C5","v":""},{"$f":"INVULBLAD!$C6","v":"nee"},{"$f":"INVULBLAD!$C7","v":"nee"},{"$f":"INVULBLAD!$C8","v":"geen"},{"$f":"INVULBLAD!$C9","v":"nee"},{"$f":"INVULBLAD!$C10","v":"nee"},{"$f":"INVULBLAD!$C11","v":"geen"},{"$f":"INVULBLAD!$C12","v":"nee"},{"$f":"INVULBLAD!$C13","v":"geen"},{"$f":"INVULBLAD!$C14","v":"geen"},{"$f":"INVULBLAD!$C15","v":"nee"},{"$f":"INVULBLAD!$C16","v":"geen"}]
[{"$f":"INVULBLAD!$D1","v":2},{"$f":"INVULBLAD!$D2","v":"Vrij"},{"$f":"INVULBLAD!$D3","v":0},{"$f":"INVULBLAD!$D4","v":0},{"$f":"INVULBLAD!$D5","v":""},{"$f":"INVULBLAD!$D6","v":"nee"},{"$f":"INVULBLAD!$D7","v":"nee"},{"$f":"INVULBLAD!$D8","v":"geen"},{"$f":"INVULBLAD!$D9","v":"nee"},{"$f":"INVULBLAD!$D10","v":"nee"},{"$f":"INVULBLAD!$D11","v":"geen"},{"$f":"INVULBLAD!$D12","v":"nee"},{"$f":"INVULBLAD!$D13","v":"geen"},{"$f":"INVULBLAD!$D14","v":"geen"},{"$f":"INVULBLAD!$D15","v":"nee"},{"$f":"INVULBLAD!$D16","v":"geen"}]
[{"$f":"INVULBLAD!$E1","v":3},{"$f":"INVULBLAD!$E2","v":"Vrij"},{"$f":"INVULBLAD!$E3","v":0},{"$f":"INVULBLAD!$E4","v":0},{"$f":"INVULBLAD!$E5","v":""},{"$f":"INVULBLAD!$E6","v":"nee"},{"$f":"INVULBLAD!$E7","v":"nee"},{"$f":"INVULBLAD!$E8","v":"geen"},{"$f":"INVULBLAD!$E9","v":"nee"},{"$f":"INVULBLAD!$E10","v":"nee"},{"$f":"INVULBLAD!$E11","v":"geen"},{"$f":"INVULBLAD!$E12","v":"nee"},{"$f":"INVULBLAD!$E13","v":"geen"},{"$f":"INVULBLAD!$E14","v":"geen"},{"$f":"INVULBLAD!$E15","v":"nee"},{"$f":"INVULBLAD!$E16","v":"geen"}]
[{"$f":"INVULBLAD!$F1","v":4},{"$f":"INVULBLAD!$F2","v":"Vrij"},{"$f":"INVULBLAD!$F3","v":0},{"$f":"INVULBLAD!$F4","v":0},{"$f":"INVULBLAD!$F5","v":""},{"$f":"INVULBLAD!$F6","v":"nee"},{"$f":"INVULBLAD!$F7","v":"nee"},{"$f":"INVULBLAD!$F8","v":"geen"},{"$f":"INVULBLAD!$F9","v":"nee"},{"$f":"INVULBLAD!$F10","v":"nee"},{"$f":"INVULBLAD!$F11","v":"geen"},{"$f":"INVULBLAD!$F12","v":"nee"},{"$f":"INVULBLAD!$F13","v":"geen"},{"$f":"INVULBLAD!$F14","v":"geen"},{"$f":"INVULBLAD!$F15","v":"nee"},{"$f":"INVULBLAD!$F16","v":"geen"}]
[{"$f":"INVULBLAD!$G1","v":5},{"$f":"INVULBLAD!$G2","v":"Vrij"},{"$f":"INVULBLAD!$G3","v":0},{"$f":"INVULBLAD!$G4","v":0},{"$f":"INVULBLAD!$G5","v":""},{"$f":"INVULBLAD!$G6","v":"nee"},{"$f":"INVULBLAD!$G7","v":"nee"},{"$f":"INVULBLAD!$G8","v":"geen"},{"$f":"INVULBLAD!$G9","v":"nee"},{"$f":"INVULBLAD!$G10","v":"nee"},{"$f":"INVULBLAD!$G11","v":"geen"},{"$f":"INVULBLAD!$G12","v":"nee"},{"$f":"INVULBLAD!$G13","v":"geen"},{"$f":"INVULBLAD!$G14","v":"geen"},{"$f":"INVULBLAD!$G15","v":"nee"},{"$f":"INVULBLAD!$G16","v":"geen"}]
[{"$f":"INVULBLAD!$H1","v":6},{"$f":"INVULBLAD!$H2","v":"Vrij"},{"$f":"INVULBLAD!$H3","v":0},{"$f":"INVULBLAD!$H4","v":0},{"$f":"INVULBLAD!$H5","v":""},{"$f":"INVULBLAD!$H6","v":"nee"},{"$f":"INVULBLAD!$H7","v":"nee"},{"$f":"INVULBLAD!$H8","v":"geen"},{"$f":"INVULBLAD!$H9","v":"nee"},{"$f":"INVULBLAD!$H10","v":"nee"},{"$f":"INVULBLAD!$H11","v":"geen"},{"$f":"INVULBLAD!$H12","v":"nee"},{"$f":"INVULBLAD!$H13","v":"geen"},{"$f":"INVULBLAD!$H14","v":"geen"},{"$f":"INVULBLAD!$H15","v":"nee"},{"$f":"INVULBLAD!$H16","v":"geen"}]
[{"$f":"INVULBLAD!$I1","v":7},{"$f":"INVULBLAD!$I2","v":"Vrij"},{"$f":"INVULBLAD!$I3","v":0},{"$f":"INVULBLAD!$I4","v":0},{"$f":"INVULBLAD!$I5","v":""},{"$f":"INVULBLAD!$I6","v":"nee"},{"$f":"INVULBLAD!$I7","v":"nee"},{"$f":"INVULBLAD!$I8","v":"geen"},{"$f":"INVULBLAD!$I9","v":"nee"},{"$f":"INVULBLAD!$I10","v":"nee"},{"$f":"INVULBLAD!$I11","v":"geen"},{"$f":"INVULBLAD!$I12","v":"nee"},{"$f":"INVULBLAD!$I13","v":"geen"},{"$f":"INVULBLAD!$I14","v":"geen"},{"$f":"INVULBLAD!$I15","v":"nee"},{"$f":"INVULBLAD!$I16","v":"geen"}]
[{"$f":"INVULBLAD!$J1","v":8},{"$f":"INVULBLAD!$J2","v":"Vrij"},{"$f":"INVULBLAD!$J3","v":0},{"$f":"INVULBLAD!$J4","v":0},{"$f":"INVULBLAD!$J5","v":""},{"$f":"INVULBLAD!$J6","v":"nee"},{"$f":"INVULBLAD!$J7","v":"nee"},{"$f":"INVULBLAD!$J8","v":"geen"},{"$f":"INVULBLAD!$J9","v":"nee"},{"$f":"INVULBLAD!$J10","v":"nee"},{"$f":"INVULBLAD!$J11","v":"geen"},{"$f":"INVULBLAD!$J12","v":"nee"},{"$f":"INVULBLAD!$J13","v":"geen"},{"$f":"INVULBLAD!$J14","v":"geen"},{"$f":"INVULBLAD!$J15","v":"nee"},{"$f":"INVULBLAD!$J16","v":"geen"}]
[{"$f":"INVULBLAD!$K1","v":9},{"$f":"INVULBLAD!$K2","v":"Vrij"},{"$f":"INVULBLAD!$K3","v":0},{"$f":"INVULBLAD!$K4","v":0},{"$f":"INVULBLAD!$K5","v":""},{"$f":"INVULBLAD!$K6","v":"nee"},{"$f":"INVULBLAD!$K7","v":"nee"},{"$f":"INVULBLAD!$K8","v":"geen"},{"$f":"INVULBLAD!$K9","v":"nee"},{"$f":"INVULBLAD!$K10","v":"nee"},{"$f":"INVULBLAD!$K11","v":"geen"},{"$f":"INVULBLAD!$K12","v":"nee"},{"$f":"INVULBLAD!$K13","v":"geen"},{"$f":"INVULBLAD!$K14","v":"geen"},{"$f":"INVULBLAD!$K15","v":"nee"},{"$f":"INVULBLAD!$K16","v":"geen"}]
[{"$f":"INVULBLAD!$L1","v":10},{"$f":"INVULBLAD!$L2","v":"Vrij"},{"$f":"INVULBLAD!$L3","v":0},{"$f":"INVULBLAD!$L4","v":0},{"$f":"INVULBLAD!$L5","v":""},{"$f":"INVULBLAD!$L6","v":"nee"},{"$f":"INVULBLAD!$L7","v":"nee"},{"$f":"INVULBLAD!$L8","v":"geen"},{"$f":"INVULBLAD!$L9","v":"nee"},{"$f":"INVULBLAD!$L10","v":"nee"},{"$f":"INVULBLAD!$L11","v":"geen"},{"$f":"INVULBLAD!$L12","v":"nee"},{"$f":"INVULBLAD!$L13","v":"geen"},{"$f":"INVULBLAD!$L14","v":"geen"},{"$f":"INVULBLAD!$L15","v":"nee"},{"$f":"INVULBLAD!$L16","v":"geen"}]
[{"$f":"INVULBLAD!$M1","v":11},{"$f":"INVULBLAD!$M2","v":"Vrij"},{"$f":"INVULBLAD!$M3","v":0},{"$f":"INVULBLAD!$M4","v":0},{"$f":"INVULBLAD!$M5","v":""},{"$f":"INVULBLAD!$M6","v":"nee"},{"$f":"INVULBLAD!$M7","v":"nee"},{"$f":"INVULBLAD!$M8","v":"geen"},{"$f":"INVULBLAD!$M9","v":"nee"},{"$f":"INVULBLAD!$M10","v":"nee"},{"$f":"INVULBLAD!$M11","v":"geen"},{"$f":"INVULBLAD!$M12","v":"nee"},{"$f":"INVULBLAD!$M13","v":"geen"},{"$f":"INVULBLAD!$M14","v":"geen"},{"$f":"INVULBLAD!$M15","v":"nee"},{"$f":"INVULBLAD!$M16","v":"geen"}]
[{"$f":"INVULBLAD!$N1","v":12},{"$f":"INVULBLAD!$N2","v":"Vrij"},{"$f":"INVULBLAD!$N3","v":0},{"$f":"INVULBLAD!$N4","v":0},{"$f":"INVULBLAD!$N5","v":""},{"$f":"INVULBLAD!$N6","v":"nee"},{"$f":"INVULBLAD!$N7","v":"nee"},{"$f":"INVULBLAD!$N8","v":"geen"},{"$f":"INVULBLAD!$N9","v":"nee"},{"$f":"INVULBLAD!$N10","v":"nee"},{"$f":"INVULBLAD!$N11","v":"geen"},{"$f":"INVULBLAD!$N12","v":"nee"},{"$f":"INVULBLAD!$N13","v":"geen"},{"$f":"INVULBLAD!$N14","v":"geen"},{"$f":"INVULBLAD!$N15","v":"nee"},{"$f":"INVULBLAD!$N16","v":"geen"}]
[{"$f":"INVULBLAD!$O1","v":13},{"$f":"INVULBLAD!$O2","v":"Vrij"},{"$f":"INVULBLAD!$O3","v":0},{"$f":"INVULBLAD!$O4","v":0},{"$f":"INVULBLAD!$O5","v":""},{"$f":"INVULBLAD!$O6","v":"nee"},{"$f":"INVULBLAD!$O7","v":"nee"},{"$f":"INVULBLAD!$O8","v":"geen"},{"$f":"INVULBLAD!$O9","v":"nee"},{"$f":"INVULBLAD!$O10","v":"nee"},{"$f":"INVULBLAD!$O11","v":"geen"},{"$f":"INVULBLAD!$O12","v":"nee"},{"$f":"INVULBLAD!$O13","v":"geen"},{"$f":"INVULBLAD!$O14","v":"geen"},{"$f":"INVULBLAD!$O15","v":"nee"},{"$f":"INVULBLAD!$O16","v":"geen"}]
[{"$f":"INVULBLAD!$P1","v":14},{"$f":"INVULBLAD!$P2","v":"Vrij"},{"$f":"INVULBLAD!$P3","v":0},{"$f":"INVULBLAD!$P4","v":0},{"$f":"INVULBLAD!$P5","v":""},{"$f":"INVULBLAD!$P6","v":"nee"},{"$f":"INVULBLAD!$P7","v":"nee"},{"$f":"INVULBLAD!$P8","v":"geen"},{"$f":"INVULBLAD!$P9","v":"nee"},{"$f":"INVULBLAD!$P10","v":"nee"},{"$f":"INVULBLAD!$P11","v":"geen"},{"$f":"INVULBLAD!$P12","v":"nee"},{"$f":"INVULBLAD!$P13","v":"geen"},{"$f":"INVULBLAD!$P14","v":"geen"},{"$f":"INVULBLAD!$P15","v":"nee"},{"$f":"INVULBLAD!$P16","v":"geen"}]
[{"$f":"INVULBLAD!$Q1","v":15},{"$f":"INVULBLAD!$Q2","v":"Vrij"},{"$f":"INVULBLAD!$Q3","v":0},{"$f":"INVULBLAD!$Q4","v":0},{"$f":"INVULBLAD!$Q5","v":""},{"$f":"INVULBLAD!$Q6","v":"nee"},{"$f":"INVULBLAD!$Q7","v":"nee"},{"$f":"INVULBLAD!$Q8","v":"geen"},{"$f":"INVULBLAD!$Q9","v":"nee"},{"$f":"INVULBLAD!$Q10","v":"nee"},{"$f":"INVULBLAD!$Q11","v":"geen"},{"$f":"INVULBLAD!$Q12","v":"nee"},{"$f":"INVULBLAD!$Q13","v":"geen"},{"$f":"INVULBLAD!$Q14","v":"geen"},{"$f":"INVULBLAD!$Q15","v":"nee"},{"$f":"INVULBLAD!$Q16","v":"geen"}]
[{"$f":"INVULBLAD!$R1","v":16},{"$f":"INVULBLAD!$R2","v":"Vrij"},{"$f":"INVULBLAD!$R3","v":0},{"$f":"INVULBLAD!$R4","v":0},{"$f":"INVULBLAD!$R5","v":""},{"$f":"INVULBLAD!$R6","v":"nee"},{"$f":"INVULBLAD!$R7","v":"nee"},{"$f":"INVULBLAD!$R8","v":"geen"},{"$f":"INVULBLAD!$R9","v":"nee"},{"$f":"INVULBLAD!$R10","v":"nee"},{"$f":"INVULBLAD!$R11","v":"geen"},{"$f":"INVULBLAD!$R12","v":"nee"},{"$f":"INVULBLAD!$R13","v":"geen"},{"$f":"INVULBLAD!$R14","v":"geen"},{"$f":"INVULBLAD!$R15","v":"nee"},{"$f":"INVULBLAD!$R16","v":"geen"}]
[{"$f":"INVULBLAD!$S1","v":17},{"$f":"INVULBLAD!$S2","v":"Vrij"},{"$f":"INVULBLAD!$S3","v":0},{"$f":"INVULBLAD!$S4","v":0},{"$f":"INVULBLAD!$S5","v":""},{"$f":"INVULBLAD!$S6","v":"nee"},{"$f":"INVULBLAD!$S7","v":"nee"},{"$f":"INVULBLAD!$S8","v":"geen"},{"$f":"INVULBLAD!$S9","v":"nee"},{"$f":"INVULBLAD!$S10","v":"nee"},{"$f":"INVULBLAD!$S11","v":"geen"},{"$f":"INVULBLAD!$S12","v":"nee"},{"$f":"INVULBLAD!$S13","v":"geen"},{"$f":"INVULBLAD!$S14","v":"geen"},{"$f":"INVULBLAD!$S15","v":"nee"},{"$f":"INVULBLAD!$S16","v":"geen"}]
[{"$f":"INVULBLAD!$T1","v":18},{"$f":"INVULBLAD!$T2","v":"Vrij"},{"$f":"INVULBLAD!$T3","v":0},{"$f":"INVULBLAD!$T4","v":0},{"$f":"INVULBLAD!$T5","v":""},{"$f":"INVULBLAD!$T6","v":"nee"},{"$f":"INVULBLAD!$T7","v":"nee"},{"$f":"INVULBLAD!$T8","v":"geen"},{"$f":"INVULBLAD!$T9","v":"nee"},{"$f":"INVULBLAD!$T10","v":"nee"},{"$f":"INVULBLAD!$T11","v":"geen"},{"$f":"INVULBLAD!$T12","v":"nee"},{"$f":"INVULBLAD!$T13","v":"geen"},{"$f":"INVULBLAD!$T14","v":"geen"},{"$f":"INVULBLAD!$T15","v":"nee"},{"$f":"INVULBLAD!$T16","v":"geen"}]
[{"$f":"INVULBLAD!$U1","v":19},{"$f":"INVULBLAD!$U2","v":"Vrij"},{"$f":"INVULBLAD!$U3","v":0},{"$f":"INVULBLAD!$U4","v":0},{"$f":"INVULBLAD!$U5","v":""},{"$f":"INVULBLAD!$U6","v":"nee"},{"$f":"INVULBLAD!$U7","v":"nee"},{"$f":"INVULBLAD!$U8","v":"geen"},{"$f":"INVULBLAD!$U9","v":"nee"},{"$f":"INVULBLAD!$U10","v":"nee"},{"$f":"INVULBLAD!$U11","v":"geen"},{"$f":"INVULBLAD!$U12","v":"nee"},{"$f":"INVULBLAD!$U13","v":"geen"},{"$f":"INVULBLAD!$U14","v":"geen"},{"$f":"INVULBLAD!$U15","v":"nee"},{"$f":"INVULBLAD!$U16","v":"geen"}]
[{"$f":"INVULBLAD!$V1","v":20},{"$f":"INVULBLAD!$V2","v":"Vrij"},{"$f":"INVULBLAD!$V3","v":0},{"$f":"INVULBLAD!$V4","v":0},{"$f":"INVULBLAD!$V5","v":""},{"$f":"INVULBLAD!$V6","v":"nee"},{"$f":"INVULBLAD!$V7","v":"nee"},{"$f":"INVULBLAD!$V8","v":"geen"},{"$f":"INVULBLAD!$V9","v":"nee"},{"$f":"INVULBLAD!$V10","v":"nee"},{"$f":"INVULBLAD!$V11","v":"geen"},{"$f":"INVULBLAD!$V12","v":"nee"},{"$f":"INVULBLAD!$V13","v":"geen"},{"$f":"INVULBLAD!$V14","v":"geen"},{"$f":"INVULBLAD!$V15","v":"nee"},{"$f":"INVULBLAD!$V16","v":"geen"}]
[{"$f":"INVULBLAD!$W1","v":21},{"$f":"INVULBLAD!$W2","v":"Vrij"},{"$f":"INVULBLAD!$W3","v":0},{"$f":"INVULBLAD!$W4","v":0},{"$f":"INVULBLAD!$W5","v":""},{"$f":"INVULBLAD!$W6","v":"nee"},{"$f":"INVULBLAD!$W7","v":"nee"},{"$f":"INVULBLAD!$W8","v":"geen"},{"$f":"INVULBLAD!$W9","v":"nee"},{"$f":"INVULBLAD!$W10","v":"nee"},{"$f":"INVULBLAD!$W11","v":"geen"},{"$f":"INVULBLAD!$W12","v":"nee"},{"$f":"INVULBLAD!$W13","v":"geen"},{"$f":"INVULBLAD!$W14","v":"geen"},{"$f":"INVULBLAD!$W15","v":"nee"},{"$f":"INVULBLAD!$W16","v":"geen"}]
[{"$f":"INVULBLAD!$X1","v":22},{"$f":"INVULBLAD!$X2","v":"Vrij"},{"$f":"INVULBLAD!$X3","v":0},{"$f":"INVULBLAD!$X4","v":0},{"$f":"INVULBLAD!$X5","v":""},{"$f":"INVULBLAD!$X6","v":"nee"},{"$f":"INVULBLAD!$X7","v":"nee"},{"$f":"INVULBLAD!$X8","v":"geen"},{"$f":"INVULBLAD!$X9","v":"nee"},{"$f":"INVULBLAD!$X10","v":"nee"},{"$f":"INVULBLAD!$X11","v":"geen"},{"$f":"INVULBLAD!$X12","v":"nee"},{"$f":"INVULBLAD!$X13","v":"geen"},{"$f":"INVULBLAD!$X14","v":"geen"},{"$f":"INVULBLAD!$X15","v":"nee"},{"$f":"INVULBLAD!$X16","v":"geen"}]
[{"$f":"INVULBLAD!$Y1","v":23},{"$f":"INVULBLAD!$Y2","v":"Vrij"},{"$f":"INVULBLAD!$Y3","v":0},{"$f":"INVULBLAD!$Y4","v":0},{"$f":"INVULBLAD!$Y5","v":""},{"$f":"INVULBLAD!$Y6","v":"nee"},{"$f":"INVULBLAD!$Y7","v":"nee"},{"$f":"INVULBLAD!$Y8","v":"geen"},{"$f":"INVULBLAD!$Y9","v":"nee"},{"$f":"INVULBLAD!$Y10","v":"nee"},{"$f":"INVULBLAD!$Y11","v":"geen"},{"$f":"INVULBLAD!$Y12","v":"nee"},{"$f":"INVULBLAD!$Y13","v":"geen"},{"$f":"INVULBLAD!$Y14","v":"geen"},{"$f":"INVULBLAD!$Y15","v":"nee"},{"$f":"INVULBLAD!$Y16","v":"geen"}]
[{"$f":"INVULBLAD!$Z1","v":24},{"$f":"INVULBLAD!$Z2","v":"Vrij"},{"$f":"INVULBLAD!$Z3","v":0},{"$f":"INVULBLAD!$Z4","v":0},{"$f":"INVULBLAD!$Z5","v":""},{"$f":"INVULBLAD!$Z6","v":"nee"},{"$f":"INVULBLAD!$Z7","v":"nee"},{"$f":"INVULBLAD!$Z8","v":"geen"},{"$f":"INVULBLAD!$Z9","v":"nee"},{"$f":"INVULBLAD!$Z10","v":"nee"},{"$f":"INVULBLAD!$Z11","v":"geen"},{"$f":"INVULBLAD!$Z12","v":"nee"},{"$f":"INVULBLAD!$Z13","v":"geen"},{"$f":"INVULBLAD!$Z14","v":"geen"},{"$f":"INVULBLAD!$Z15","v":"nee"},{"$f":"INVULBLAD!$Z16","v":"geen"}]
[{"$f":"INVULBLAD!$AA1","v":25},{"$f":"INVULBLAD!$AA2","v":"Vrij"},{"$f":"INVULBLAD!$AA3","v":0},{"$f":"INVULBLAD!$AA4","v":0},{"$f":"INVULBLAD!$AA5","v":""},{"$f":"INVULBLAD!$AA6","v":"nee"},{"$f":"INVULBLAD!$AA7","v":"nee"},{"$f":"INVULBLAD!$AA8","v":"geen"},{"$f":"INVULBLAD!$AA9","v":"nee"},{"$f":"INVULBLAD!$AA10","v":"nee"},{"$f":"INVULBLAD!$AA11","v":"geen"},{"$f":"INVULBLAD!$AA12","v":"nee"},{"$f":"INVULBLAD!$AA13","v":"geen"},{"$f":"INVULBLAD!$AA14","v":"geen"},{"$f":"INVULBLAD!$AA15","v":"nee"},{"$f":"INVULBLAD!$AA16","v":"geen"}]
[{"$f":"INVULBLAD!$AB1","v":26},{"$f":"INVULBLAD!$AB2","v":"Vrij"},{"$f":"INVULBLAD!$AB3","v":0},{"$f":"INVULBLAD!$AB4","v":0},{"$f":"INVULBLAD!$AB5","v":""},{"$f":"INVULBLAD!$AB6","v":"nee"},{"$f":"INVULBLAD!$AB7","v":"nee"},{"$f":"INVULBLAD!$AB8","v":"geen"},{"$f":"INVULBLAD!$AB9","v":"nee"},{"$f":"INVULBLAD!$AB10","v":"nee"},{"$f":"INVULBLAD!$AB11","v":"geen"},{"$f":"INVULBLAD!$AB12","v":"nee"},{"$f":"INVULBLAD!$AB13","v":"geen"},{"$f":"INVULBLAD!$AB14","v":"geen"},{"$f":"INVULBLAD!$AB15","v":"nee"},{"$f":"INVULBLAD!$AB16","v":"geen"}]
[{"$f":"INVULBLAD!$AC1","v":27},{"$f":"INVULBLAD!$AC2","v":"Vrij"},{"$f":"INVULBLAD!$AC3","v":0},{"$f":"INVULBLAD!$AC4","v":0},{"$f":"INVULBLAD!$AC5","v":""},{"$f":"INVULBLAD!$AC6","v":"nee"},{"$f":"INVULBLAD!$AC7","v":"nee"},{"$f":"INVULBLAD!$AC8","v":"geen"},{"$f":"INVULBLAD!$AC9","v":"nee"},{"$f":"INVULBLAD!$AC10","v":"nee"},{"$f":"INVULBLAD!$AC11","v":"geen"},{"$f":"INVULBLAD!$AC12","v":"nee"},{"$f":"INVULBLAD!$AC13","v":"geen"},{"$f":"INVULBLAD!$AC14","v":"geen"},{"$f":"INVULBLAD!$AC15","v":"nee"},{"$f":"INVULBLAD!$AC16","v":"geen"}]
[{"$f":"INVULBLAD!$AD1","v":28},{"$f":"INVULBLAD!$AD2","v":"Vrij"},{"$f":"INVULBLAD!$AD3","v":0},{"$f":"INVULBLAD!$AD4","v":0},{"$f":"INVULBLAD!$AD5","v":""},{"$f":"INVULBLAD!$AD6","v":"nee"},{"$f":"INVULBLAD!$AD7","v":"nee"},{"$f":"INVULBLAD!$AD8","v":"geen"},{"$f":"INVULBLAD!$AD9","v":"nee"},{"$f":"INVULBLAD!$AD10","v":"nee"},{"$f":"INVULBLAD!$AD11","v":"geen"},{"$f":"INVULBLAD!$AD12","v":"nee"},{"$f":"INVULBLAD!$AD13","v":"geen"},{"$f":"INVULBLAD!$AD14","v":"geen"},{"$f":"INVULBLAD!$AD15","v":"nee"},{"$f":"INVULBLAD!$AD16","v":"geen"}]
[{"$f":"INVULBLAD!$AE1","v":29},{"$f":"INVULBLAD!$AE2","v":"Vrij"},{"$f":"INVULBLAD!$AE3","v":0},{"$f":"INVULBLAD!$AE4","v":0},{"$f":"INVULBLAD!$AE5","v":""},{"$f":"INVULBLAD!$AE6","v":"nee"},{"$f":"INVULBLAD!$AE7","v":"nee"},{"$f":"INVULBLAD!$AE8","v":"geen"},{"$f":"INVULBLAD!$AE9","v":"nee"},{"$f":"INVULBLAD!$AE10","v":"nee"},{"$f":"INVULBLAD!$AE11","v":"geen"},{"$f":"INVULBLAD!$AE12","v":"nee"},{"$f":"INVULBLAD!$AE13","v":"geen"},{"$f":"INVULBLAD!$AE14","v":"geen"},{"$f":"INVULBLAD!$AE15","v":"nee"},{"$f":"INVULBLAD!$AE16","v":"geen"}]
[{"$f":"INVULBLAD!$AF1","v":30},{"$f":"INVULBLAD!$AF2","v":"Vrij"},{"$f":"INVULBLAD!$AF3","v":0},{"$f":"INVULBLAD!$AF4","v":0},{"$f":"INVULBLAD!$AF5","v":""},{"$f":"INVULBLAD!$AF6","v":"nee"},{"$f":"INVULBLAD!$AF7","v":"nee"},{"$f":"INVULBLAD!$AF8","v":"geen"},{"$f":"INVULBLAD!$AF9","v":"nee"},{"$f":"INVULBLAD!$AF10","v":"nee"},{"$f":"INVULBLAD!$AF11","v":"geen"},{"$f":"INVULBLAD!$AF12","v":"nee"},{"$f":"INVULBLAD!$AF13","v":"geen"},{"$f":"INVULBLAD!$AF14","v":"geen"},{"$f":"INVULBLAD!$AF15","v":"nee"},{"$f":"INVULBLAD!$AF16","v":"geen"}]
[{"$f":"INVULBLAD!$AG1","v":31},{"$f":"INVULBLAD!$AG2","v":"Vrij"},{"$f":"INVULBLAD!$AG3","v":0},{"$f":"INVULBLAD!$AG4","v":0},{"$f":"INVULBLAD!$AG5","v":""},{"$f":"INVULBLAD!$AG6","v":"nee"},{"$f":"INVULBLAD!$AG7","v":"nee"},{"$f":"INVULBLAD!$AG8","v":"geen"},{"$f":"INVULBLAD!$AG9","v":"nee"},{"$f":"INVULBLAD!$AG10","v":"nee"},{"$f":"INVULBLAD!$AG11","v":"geen"},{"$f":"INVULBLAD!$AG12","v":"nee"},{"$f":"INVULBLAD!$AG13","v":"geen"},{"$f":"INVULBLAD!$AG14","v":"geen"},{"$f":"INVULBLAD!$AG15","v":"nee"},{"$f":"INVULBLAD!$AG16","v":"geen"}]
[{"$f":"INVULBLAD!$AH1","v":32},{"$f":"INVULBLAD!$AH2","v":"Vrij"},{"$f":"INVULBLAD!$AH3","v":0},{"$f":"INVULBLAD!$AH4","v":0},{"$f":"INVULBLAD!$AH5","v":""},{"$f":"INVULBLAD!$AH6","v":"nee"},{"$f":"INVULBLAD!$AH7","v":"nee"},{"$f":"INVULBLAD!$AH8","v":"geen"},{"$f":"INVULBLAD!$AH9","v":"nee"},{"$f":"INVULBLAD!$AH10","v":"nee"},{"$f":"INVULBLAD!$AH11","v":"geen"},{"$f":"INVULBLAD!$AH12","v":"nee"},{"$f":"INVULBLAD!$AH13","v":"geen"},{"$f":"INVULBLAD!$AH14","v":"geen"},{"$f":"INVULBLAD!$AH15","v":"nee"},{"$f":"INVULBLAD!$AH16","v":"geen"}]
[{"$f":"INVULBLAD!$AI1","v":33},{"$f":"INVULBLAD!$AI2","v":"Vrij"},{"$f":"INVULBLAD!$AI3","v":0},{"$f":"INVULBLAD!$AI4","v":0},{"$f":"INVULBLAD!$AI5","v":""},{"$f":"INVULBLAD!$AI6","v":"nee"},{"$f":"INVULBLAD!$AI7","v":"nee"},{"$f":"INVULBLAD!$AI8","v":"geen"},{"$f":"INVULBLAD!$AI9","v":"nee"},{"$f":"INVULBLAD!$AI10","v":"nee"},{"$f":"INVULBLAD!$AI11","v":"geen"},{"$f":"INVULBLAD!$AI12","v":"nee"},{"$f":"INVULBLAD!$AI13","v":"geen"},{"$f":"INVULBLAD!$AI14","v":"geen"},{"$f":"INVULBLAD!$AI15","v":"nee"},{"$f":"INVULBLAD!$AI16","v":"geen"}]
[{"$f":"INVULBLAD!$AJ1","v":34},{"$f":"INVULBLAD!$AJ2","v":"Vrij"},{"$f":"INVULBLAD!$AJ3","v":0},{"$f":"INVULBLAD!$AJ4","v":0},{"$f":"INVULBLAD!$AJ5","v":""},{"$f":"INVULBLAD!$AJ6","v":"nee"},{"$f":"INVULBLAD!$AJ7","v":"nee"},{"$f":"INVULBLAD!$AJ8","v":"geen"},{"$f":"INVULBLAD!$AJ9","v":"nee"},{"$f":"INVULBLAD!$AJ10","v":"nee"},{"$f":"INVULBLAD!$AJ11","v":"geen"},{"$f":"INVULBLAD!$AJ12","v":"nee"},{"$f":"INVULBLAD!$AJ13","v":"geen"},{"$f":"INVULBLAD!$AJ14","v":"geen"},{"$f":"INVULBLAD!$AJ15","v":"nee"},{"$f":"INVULBLAD!$AJ16","v":"geen"}]
[{"$f":"INVULBLAD!$AK1","v":35},{"$f":"INVULBLAD!$AK2","v":"Vrij"},{"$f":"INVULBLAD!$AK3","v":0},{"$f":"INVULBLAD!$AK4","v":0},{"$f":"INVULBLAD!$AK5","v":""},{"$f":"INVULBLAD!$AK6","v":"nee"},{"$f":"INVULBLAD!$AK7","v":"nee"},{"$f":"INVULBLAD!$AK8","v":"geen"},{"$f":"INVULBLAD!$AK9","v":"nee"},{"$f":"INVULBLAD!$AK10","v":"nee"},{"$f":"INVULBLAD!$AK11","v":"geen"},{"$f":"INVULBLAD!$AK12","v":"nee"},{"$f":"INVULBLAD!$AK13","v":"geen"},{"$f":"INVULBLAD!$AK14","v":"geen"},{"$f":"INVULBLAD!$AK15","v":"nee"},{"$f":"INVULBLAD!$AK16","v":"geen"}]
[{"$f":"INVULBLAD!$AL1","v":36},{"$f":"INVULBLAD!$AL2","v":"Vrij"},{"$f":"INVULBLAD!$AL3","v":0},{"$f":"INVULBLAD!$AL4","v":0},{"$f":"INVULBLAD!$AL5","v":""},{"$f":"INVULBLAD!$AL6","v":"nee"},{"$f":"INVULBLAD!$AL7","v":"nee"},{"$f":"INVULBLAD!$AL8","v":"geen"},{"$f":"INVULBLAD!$AL9","v":"nee"},{"$f":"INVULBLAD!$AL10","v":"nee"},{"$f":"INVULBLAD!$AL11","v":"geen"},{"$f":"INVULBLAD!$AL12","v":"nee"},{"$f":"INVULBLAD!$AL13","v":"geen"},{"$f":"INVULBLAD!$AL14","v":"geen"},{"$f":"INVULBLAD!$AL15","v":"nee"},{"$f":"INVULBLAD!$AL16","v":"geen"}]
[{"$f":"INVULBLAD!$AM1","v":37},{"$f":"INVULBLAD!$AM2","v":"Vrij"},{"$f":"INVULBLAD!$AM3","v":0},{"$f":"INVULBLAD!$AM4","v":0},{"$f":"INVULBLAD!$AM5","v":""},{"$f":"INVULBLAD!$AM6","v":"nee"},{"$f":"INVULBLAD!$AM7","v":"nee"},{"$f":"INVULBLAD!$AM8","v":"geen"},{"$f":"INVULBLAD!$AM9","v":"nee"},{"$f":"INVULBLAD!$AM10","v":"nee"},{"$f":"INVULBLAD!$AM11","v":"geen"},{"$f":"INVULBLAD!$AM12","v":"nee"},{"$f":"INVULBLAD!$AM13","v":"geen"},{"$f":"INVULBLAD!$AM14","v":"geen"},{"$f":"INVULBLAD!$AM15","v":"nee"},{"$f":"INVULBLAD!$AM16","v":"geen"}]
[{"$f":"INVULBLAD!$AN1","v":38},{"$f":"INVULBLAD!$AN2","v":"Vrij"},{"$f":"INVULBLAD!$AN3","v":0},{"$f":"INVULBLAD!$AN4","v":0},{"$f":"INVULBLAD!$AN5","v":""},{"$f":"INVULBLAD!$AN6","v":"nee"},{"$f":"INVULBLAD!$AN7","v":"nee"},{"$f":"INVULBLAD!$AN8","v":"geen"},{"$f":"INVULBLAD!$AN9","v":"nee"},{"$f":"INVULBLAD!$AN10","v":"nee"},{"$f":"INVULBLAD!$AN11","v":"geen"},{"$f":"INVULBLAD!$AN12","v":"nee"},{"$f":"INVULBLAD!$AN13","v":"geen"},{"$f":"INVULBLAD!$AN14","v":"geen"},{"$f":"INVULBLAD!$AN15","v":"nee"},{"$f":"INVULBLAD!$AN16","v":"geen"}]
[{"$f":"INVULBLAD!$AO1","v":39},{"$f":"INVULBLAD!$AO2","v":"Vrij"},{"$f":"INVULBLAD!$AO3","v":0},{"$f":"INVULBLAD!$AO4","v":0},{"$f":"INVULBLAD!$AO5","v":""},{"$f":"INVULBLAD!$AO6","v":"nee"},{"$f":"INVULBLAD!$AO7","v":"nee"},{"$f":"INVULBLAD!$AO8","v":"geen"},{"$f":"INVULBLAD!$AO9","v":"nee"},{"$f":"INVULBLAD!$AO10","v":"nee"},{"$f":"INVULBLAD!$AO11","v":"geen"},{"$f":"INVULBLAD!$AO12","v":"nee"},{"$f":"INVULBLAD!$AO13","v":"geen"},{"$f":"INVULBLAD!$AO14","v":"geen"},{"$f":"INVULBLAD!$AO15","v":"nee"},{"$f":"INVULBLAD!$AO16","v":"geen"}]
[{"$f":"INVULBLAD!$AP1","v":40},{"$f":"INVULBLAD!$AP2","v":"Vrij"},{"$f":"INVULBLAD!$AP3","v":0},{"$f":"INVULBLAD!$AP4","v":0},{"$f":"INVULBLAD!$AP5","v":""},{"$f":"INVULBLAD!$AP6","v":"nee"},{"$f":"INVULBLAD!$AP7","v":"nee"},{"$f":"INVULBLAD!$AP8","v":"geen"},{"$f":"INVULBLAD!$AP9","v":"nee"},{"$f":"INVULBLAD!$AP10","v":"nee"},{"$f":"INVULBLAD!$AP11","v":"geen"},{"$f":"INVULBLAD!$AP12","v":"nee"},{"$f":"INVULBLAD!$AP13","v":"geen"},{"$f":"INVULBLAD!$AP14","v":"geen"},{"$f":"INVULBLAD!$AP15","v":"nee"},{"$f":"INVULBLAD!$AP16","v":"geen"}]
[{"$f":"INVULBLAD!$AQ1","v":41},{"$f":"INVULBLAD!$AQ2","v":"Vrij"},{"$f":"INVULBLAD!$AQ3","v":0},{"$f":"INVULBLAD!$AQ4","v":0},{"$f":"INVULBLAD!$AQ5","v":""},{"$f":"INVULBLAD!$AQ6","v":"nee"},{"$f":"INVULBLAD!$AQ7","v":"nee"},{"$f":"INVULBLAD!$AQ8","v":"geen"},{"$f":"INVULBLAD!$AQ9","v":"nee"},{"$f":"INVULBLAD!$AQ10","v":"nee"},{"$f":"INVULBLAD!$AQ11","v":"geen"},{"$f":"INVULBLAD!$AQ12","v":"nee"},{"$f":"INVULBLAD!$AQ13","v":"geen"},{"$f":"INVULBLAD!$AQ14","v":"geen"},{"$f":"INVULBLAD!$AQ15","v":"nee"},{"$f":"INVULBLAD!$AQ16","v":"geen"}]
[{"$f":"INVULBLAD!$AR1","v":42},{"$f":"INVULBLAD!$AR2","v":"Vrij"},{"$f":"INVULBLAD!$AR3","v":0},{"$f":"INVULBLAD!$AR4","v":0},{"$f":"INVULBLAD!$AR5","v":""},{"$f":"INVULBLAD!$AR6","v":"nee"},{"$f":"INVULBLAD!$AR7","v":"nee"},{"$f":"INVULBLAD!$AR8","v":"geen"},{"$f":"INVULBLAD!$AR9","v":"nee"},{"$f":"INVULBLAD!$AR10","v":"nee"},{"$f":"INVULBLAD!$AR11","v":"geen"},{"$f":"INVULBLAD!$AR12","v":"nee"},{"$f":"INVULBLAD!$AR13","v":"geen"},{"$f":"INVULBLAD!$AR14","v":"geen"},{"$f":"INVULBLAD!$AR15","v":"nee"},{"$f":"INVULBLAD!$AR16","v":"geen"}]
[{"$f":"INVULBLAD!$AS1","v":43},{"$f":"INVULBLAD!$AS2","v":"Vrij"},{"$f":"INVULBLAD!$AS3","v":0},{"$f":"INVULBLAD!$AS4","v":0},{"$f":"INVULBLAD!$AS5","v":""},{"$f":"INVULBLAD!$AS6","v":"nee"},{"$f":"INVULBLAD!$AS7","v":"nee"},{"$f":"INVULBLAD!$AS8","v":"geen"},{"$f":"INVULBLAD!$AS9","v":"nee"},{"$f":"INVULBLAD!$AS10","v":"nee"},{"$f":"INVULBLAD!$AS11","v":"geen"},{"$f":"INVULBLAD!$AS12","v":"nee"},{"$f":"INVULBLAD!$AS13","v":"geen"},{"$f":"INVULBLAD!$AS14","v":"geen"},{"$f":"INVULBLAD!$AS15","v":"nee"},{"$f":"INVULBLAD!$AS16","v":"geen"}]
[{"$f":"INVULBLAD!$AT1","v":44},{"$f":"INVULBLAD!$AT2","v":"Vrij"},{"$f":"INVULBLAD!$AT3","v":0},{"$f":"INVULBLAD!$AT4","v":0},{"$f":"INVULBLAD!$AT5","v":""},{"$f":"INVULBLAD!$AT6","v":"nee"},{"$f":"INVULBLAD!$AT7","v":"nee"},{"$f":"INVULBLAD!$AT8","v":"geen"},{"$f":"INVULBLAD!$AT9","v":"nee"},{"$f":"INVULBLAD!$AT10","v":"nee"},{"$f":"INVULBLAD!$AT11","v":"geen"},{"$f":"INVULBLAD!$AT12","v":"nee"},{"$f":"INVULBLAD!$AT13","v":"geen"},{"$f":"INVULBLAD!$AT14","v":"geen"},{"$f":"INVULBLAD!$AT15","v":"nee"},{"$f":"INVULBLAD!$AT16","v":"geen"}]
[{"$f":"INVULBLAD!$AU1","v":45},{"$f":"INVULBLAD!$AU2","v":"Vrij"},{"$f":"INVULBLAD!$AU3","v":0},{"$f":"INVULBLAD!$AU4","v":0},{"$f":"INVULBLAD!$AU5","v":""},{"$f":"INVULBLAD!$AU6","v":"nee"},{"$f":"INVULBLAD!$AU7","v":"nee"},{"$f":"INVULBLAD!$AU8","v":"geen"},{"$f":"INVULBLAD!$AU9","v":"nee"},{"$f":"INVULBLAD!$AU10","v":"nee"},{"$f":"INVULBLAD!$AU11","v":"geen"},{"$f":"INVULBLAD!$AU12","v":"nee"},{"$f":"INVULBLAD!$AU13","v":"geen"},{"$f":"INVULBLAD!$AU14","v":"geen"},{"$f":"INVULBLAD!$AU15","v":"nee"},{"$f":"INVULBLAD!$AU16","v":"geen"}]
[{"$f":"INVULBLAD!$AV1","v":46},{"$f":"INVULBLAD!$AV2","v":"Vrij"},{"$f":"INVULBLAD!$AV3","v":0},{"$f":"INVULBLAD!$AV4","v":0},{"$f":"INVULBLAD!$AV5","v":""},{"$f":"INVULBLAD!$AV6","v":"nee"},{"$f":"INVULBLAD!$AV7","v":"nee"},{"$f":"INVULBLAD!$AV8","v":"geen"},{"$f":"INVULBLAD!$AV9","v":"nee"},{"$f":"INVULBLAD!$AV10","v":"nee"},{"$f":"INVULBLAD!$AV11","v":"geen"},{"$f":"INVULBLAD!$AV12","v":"nee"},{"$f":"INVULBLAD!$AV13","v":"geen"},{"$f":"INVULBLAD!$AV14","v":"geen"},{"$f":"INVULBLAD!$AV15","v":"nee"},{"$f":"INVULBLAD!$AV16","v":"geen"}]
[{"$f":"INVULBLAD!$AW1","v":47},{"$f":"INVULBLAD!$AW2","v":"Vrij"},{"$f":"INVULBLAD!$AW3","v":0},{"$f":"INVULBLAD!$AW4","v":0},{"$f":"INVULBLAD!$AW5","v":""},{"$f":"INVULBLAD!$AW6","v":"nee"},{"$f":"INVULBLAD!$AW7","v":"nee"},{"$f":"INVULBLAD!$AW8","v":"geen"},{"$f":"INVULBLAD!$AW9","v":"nee"},{"$f":"INVULBLAD!$AW10","v":"nee"},{"$f":"INVULBLAD!$AW11","v":"geen"},{"$f":"INVULBLAD!$AW12","v":"nee"},{"$f":"INVULBLAD!$AW13","v":"geen"},{"$f":"INVULBLAD!$AW14","v":"geen"},{"$f":"INVULBLAD!$AW15","v":"nee"},{"$f":"INVULBLAD!$AW16","v":"geen"}]
[{"$f":"INVULBLAD!$AX1","v":48},{"$f":"INVULBLAD!$AX2","v":"Vrij"},{"$f":"INVULBLAD!$AX3","v":0},{"$f":"INVULBLAD!$AX4","v":0},{"$f":"INVULBLAD!$AX5","v":""},{"$f":"INVULBLAD!$AX6","v":"nee"},{"$f":"INVULBLAD!$AX7","v":"nee"},{"$f":"INVULBLAD!$AX8","v":"geen"},{"$f":"INVULBLAD!$AX9","v":"nee"},{"$f":"INVULBLAD!$AX10","v":"nee"},{"$f":"INVULBLAD!$AX11","v":"geen"},{"$f":"INVULBLAD!$AX12","v":"nee"},{"$f":"INVULBLAD!$AX13","v":"geen"},{"$f":"INVULBLAD!$AX14","v":"geen"},{"$f":"INVULBLAD!$AX15","v":"nee"},{"$f":"INVULBLAD!$AX16","v":"geen"}]
[{"$f":"INVULBLAD!$AY1","v":49},{"$f":"INVULBLAD!$AY2","v":"Vrij"},{"$f":"INVULBLAD!$AY3","v":0},{"$f":"INVULBLAD!$AY4","v":0},{"$f":"INVULBLAD!$AY5","v":""},{"$f":"INVULBLAD!$AY6","v":"nee"},{"$f":"INVULBLAD!$AY7","v":"nee"},{"$f":"INVULBLAD!$AY8","v":"geen"},{"$f":"INVULBLAD!$AY9","v":"nee"},{"$f":"INVULBLAD!$AY10","v":"nee"},{"$f":"INVULBLAD!$AY11","v":"geen"},{"$f":"INVULBLAD!$AY12","v":"nee"},{"$f":"INVULBLAD!$AY13","v":"geen"},{"$f":"INVULBLAD!$AY14","v":"geen"},{"$f":"INVULBLAD!$AY15","v":"nee"},{"$f":"INVULBLAD!$AY16","v":"geen"}]
[{"$f":"INVULBLAD!$AZ1","v":50},{"$f":"INVULBLAD!$AZ2","v":"Vrij"},{"$f":"INVULBLAD!$AZ3","v":0},{"$f":"INVULBLAD!$AZ4","v":0},{"$f":"INVULBLAD!$AZ5","v":""},{"$f":"INVULBLAD!$AZ6","v":"nee"},{"$f":"INVULBLAD!$AZ7","v":"nee"},{"$f":"INVULBLAD!$AZ8","v":"geen"},{"$f":"INVULBLAD!$AZ9","v":"nee"},{"$f":"INVULBLAD!$AZ10","v":"nee"},{"$f":"INVULBLAD!$AZ11","v":"geen"},{"$f":"INVULBLAD!$AZ12","v":"nee"},{"$f":"INVULBLAD!$AZ13","v":"geen"},{"$f":"INVULBLAD!$AZ14","v":"geen"},{"$f":"INVULBLAD!$AZ15","v":"nee"},{"$f":"INVULBLAD!$AZ16","v":"geen"}]
[null,{"$f":"SUM(B54:B58)","v":0},null,null,"totaal aantal ",{"$f":"COUNTIF(F3:F52,\"ja\")","v":0},{"$f":"COUNTIF(G3:G52,\"ja\")","v":0},{"$f":"COUNTIF(H3:H52,\"*\")-COUNTIF(H3:H52,\"geen\")","v":0},{"$f":"COUNTIF(I3:I52,\"ja\")","v":0},{"$f":"COUNTIF(J3:J52,\"ja\")","v":0},{"$f":"COUNTIF(K3:K52,\"*\")-COUNTIF(K3:K52,\"geen\")","v":0},{"$f":"L60","v":0},{"$f":"COUNTIF(M3:M52,\"*\")-COUNTIF(M3:M52,\"geen\")","v":0},{"$f":"COUNTIF(N3:N52,\"*\")-COUNTIF(N3:N52,\"geen\")","v":0},{"$f":"COUNTIF(O3:O52,\"ja\")","v":0},{"$f":"COUNTIF(P3:P52,\"*\")-COUNTIF(P3:P52,\"geen\")","v":0}]
[null,{"$f":"COUNTIF(B3:B52,\"A\")","v":0},"A",null,null,{"$f":"COUNTIFS($B$3:$B$52,$C54,F$3:F$52,\"ja\")","v":0},{"$f":"COUNTIFS($B$3:$B$52,C54,G$3:G$52,\"ja\")","v":0},{"$f":"COUNTIFS($B$3:$B$52,C54,H$3:H$52,E$66)+COUNTIFS($B$3:$B$52,C54,H$3:H$52,E$67)+COUNTIFS($B$3:$B$52,C54,H$3:H$52,E$68)+COUNTIFS($B$3:$B$52,C54,H$3:H$52,E$69)+COUNTIFS($B$3:$B$52,C54,H$3:H$52,E$70)+COUNTIFS($B$3:$B$52,C54,H$3:H$52,E$71)+COUNTIFS($B$3:$B$52,C54,H$3:H$52,E$72)+COUNTIFS($B$3:$B$52,C54,H$3:H$52,E$73)+COUNTIFS($B$3:$B$52,C54,H$3:H$52,E$74)","v":0},{"$f":"COUNTIFS($B$3:$B$52,$C54,I$3:I$52,\"ja\")","v":0},{"$f":"COUNTIFS($B$3:$B$52,$C54,J$3:J$52,\"ja\")","v":0},{"$f":"COUNTIFS($B$3:$B$52,C54,K$3:K$52,I$66)+COUNTIFS($B$3:$B$52,C54,K$3:K$52,I$67)+COUNTIFS($B$3:$B$52,C54,K$3:K$52,I$68)+COUNTIFS($B$3:$B$52,C54,K$3:K$52,I$69)+COUNTIFS($B$3:$B$52,C54,K$3:K$52,I$70)","v":0},{"$f":"COUNTIFS($B$3:$B$52,$C54,L$3:L$52,\"ja\")","v":0},{"$f":"COUNTIFS($B$3:$B$52,C54,M$3:M$52,M$66)+COUNTIFS($B$3:$B$52,C54,M$3:M$52,M$67)+COUNTIFS($B$3:$B$52,C54,M$3:M$52,M$68)+COUNTIFS($B$3:$B$52,C54,M$3:M$52,M$69)+COUNTIFS($B$3:$B$52,C54,M$3:M$52,M$70)","v":0},{"$f":"COUNTIFS($B$3:$B$52,C54,N$3:N$52,M$74)+COUNTIFS($B$3:$B$52,C54,N$3:N$52,M$75)","v":0},{"$f":"COUNTIFS($B$3:$B$52,C54,O$3:O$52,\"ja\")","v":0},{"$f":"COUNTIFS($B$3:$B$52,C54,P$3:P$52,I$74)+COUNTIFS($B$3:$B$52,C54,P$3:P$52,I$75)+COUNTIFS($B$3:$B$52,C54,P$3:P$52,I$76)+COUNTIFS($B$3:$B$52,C54,P$3:P$52,I$77)","v":0}]
[null,{"$f":"COUNTIF(B3:B52,\"B\")","v":0},"B",null,null,{"$f":"COUNTIFS($B$3:$B$52,$C55,F$3:F$52,\"ja\")","v":0},{"$f":"COUNTIFS($B$3:$B$52,C55,G$3:G$52,\"ja\")","v":0},0,{"$f":"COUNTIFS($B$3:$B$52,$C55,I$3:I$52,\"ja\")","v":0},0,0,{"$f":"COUNTIFS($B$3:$B$52,$C55,L$3:L$52,\"ja\")","v":0},0,0,{"$f":"COUNTIFS($B$3:$B$52,C55,O$3:O$52,\"ja\")","v":0},0]
[null,{"$f":"COUNTIF(B3:B52,\"C\")","v":0},"C",null,null,{"$f":"COUNTIFS($B$3:$B$52,$C56,F$3:F$52,\"ja\")","v":0},{"$f":"COUNTIFS(B3:B52,C56,G$3:G$52,\"ja\")","v":0},0,0,0,0,0,0,0,{"$f":"COUNTIFS('detail wasgebeuren'!$B$3:$B$52,C56,O$3:O$52,\"ja\")","v":0},0]
[null,{"$f":"COUNTIF(B3:B52,\"D\")","v":0},"D",null,null,0,{"$f":"COUNTIFS($B$3:$B$52,C57,G$3:G$52,\"ja\")","v":0},0,0,0,0,0,0,0,{"$f":"COUNTIFS('detail wasgebeuren'!$B$3:$B$52,C57,O$3:O$52,\"ja\")","v":0},0]
[null,{"$f":"COUNTIF(B3:B52,\"E\")","v":0},"E",null,null,0,{"$f":"COUNTIFS($B$3:$B$52,C58,G$3:G$52,\"ja\")","v":0},0,0,0,0,0,0,0,{"$f":"COUNTIFS('detail wasgebeuren'!$B$3:$B$52,C58,O$3:O$52,\"ja\")","v":0},0]
[null,{"$f":"50-B53","v":50},"Vrij",null,null,{"$f":"COUNTIFS(B$3:B$52,C59,F$3:F$52,\"ja\")","v":0},{"$f":"COUNTIFS(B$3:B$52,C59,G$3:G$52,\"ja\")","v":0},0,{"$f":"COUNTIFS(B3:B52,\"Vrij\",I3:I52,\"ja\")","v":0},{"$f":"COUNTIFS($B4:$B53,\"vrij\",J4:J53,\"ja\")","v":0},0,0,0,0,{"$f":"COUNTIFS('detail wasgebeuren'!$B$3:$B$52,C59,O$3:O$52,\"ja\")","v":0},0]
[null,"In gebruik",null,null,"In gebruik",null,{"$f":"SUM(G54:G59)","v":0},{"$f":"SUM(H54:H59)","v":0},null,{"$f":"SUM(J54:J59)","v":0},{"$f":"SUM(K54:K59)","v":0},null,{"$f":"SUM(M54:M59)","v":0},0,null,0]
[null,"Terecht nodig",null,null,"Terecht nodig",null,{"$f":"SUM($F56:$F58)","v":0},{"$f":"SUM($F56:$F58)","v":0},null,{"$f":"SUM($I56:$I58)","v":0},{"$f":"SUM($I56:$I58)","v":0},null,{"$f":"L56","v":0},{"$f":"SUM(L57:L58)","v":0},null,{"$f":"SUM($O55:$O56)","v":0}]
[null,"Onterecht in gebruik",null,null,"Onterecht in gebruik",null,{"$f":"G60-G58-G57-G56-G55","v":0},{"$f":"H60-H56-H57-H58","v":0},null,{"$f":"J60-J55-J56-J57-J58","v":0},{"$f":"K60-K56-K57-K58","v":0},null,{"$f":"M60-M56","v":0},{"$f":"N60-N57-N58","v":0},null,{"$f":"P60-P55-P56","v":0}]
[null,"Tekort",null,null,"Tekort",null,{"$f":"G61-G55-G56-G57-G58","v":0},{"$f":"H61-H56-H57-H58","v":0},null,{"$f":"J61-J55-J56-J57-J58","v":0},{"$f":"K61-K56-K57-K58","v":0},null,{"$f":"M61-M56","v":0},{"$f":"N61-N57-N58","v":0},null,{"$f":"P61-P55-P56","v":0}]
[]
[null,null,null,null,"bed naar bed","aantal gebruikt","aantal aanwezig","vereist aantal","binnen bed","aantal gebruikt","aantal aanwezig","vereist aantal","opzetten","aantal gebruikt","aantal beschikbaar","vereist aantal"]
[null,null,null,null,"rolbord",{"$f":"COUNTIF(H$3:H$52,E66)","v":0},null,{"$f":"H61","v":0},"glijzeil",{"$f":"COUNTIF(K$3:K$52,I66)","v":0},0,{"$f":"K61","v":0},"actieve lift ",{"$f":"COUNTIF(M$3:M$52,M66)","v":0},0,{"$f":"M61","v":0}]
["O",null,null,null,"glijplank",{"$f":"COUNTIF(H$3:H$52,E67)","v":0},null,null,"glijlaken",{"$f":"COUNTIF(K$3:K$52,I67)","v":0},0,null,"opstastoel",{"$f":"COUNTIF(M$3:M$52,M67)","v":0},0]
["V",null,null,null,"glijzeil",{"$f":"COUNTIF($H$3:$H$52,E68)","v":0},null,null,"glijmat",{"$f":"COUNTIF(K$3:K$52,I68)","v":0},0,null,"opstahulp",{"$f":"COUNTIF(M$3:M$52,M68)","v":0},0]
["E",null,null,null,"glijlaken",0,null,null,"tilband",{"$f":"COUNTIF(K$3:K$52,I69)","v":0},0,null,"draaischijf",{"$f":"COUNTIF(M$3:M$52,M69)","v":0},0]
["R",null,null,null,"zweefmatras",0,null,null,"tildoek",{"$f":"COUNTIF(K$3:K$52,I70)","v":0},0,null,"transfergordel",{"$f":"COUNTIF(M$3:M$52,M70)","v":0},0]
["Z",null,null,null,"glijmat",0,null,null,"totaal",{"$f":"SUM(J66:J70)","v":0},{"$f":"SUM(K66:K70)","v":0},0,"totaal",{"$f":"SUM(N66:N70)","v":0},{"$f":"SUM(O66:O70)","v":0},{"$f":"SUM(P66:P70)","v":0}]
["I",null,null,null,"passieve tillift",0]
["C",null,null,null,"plafondlift",0,null,null,"sta- en stapmiddel","aantal gebruikt","aantal aanwezig","vereist aantal","tillift","aantal gebruikt","aantal beschikbaar","vereist aantal"]
["H",null,null,null,"ministretcher",0,null,null,"kruk",{"$f":"COUNTIF(P$3:P$52,I74)","v":0},0,{"$f":"P61","v":0},"passieve tillift",{"$f":"COUNTIF(N$3:N$52,M74)","v":0},0,{"$f":"N61","v":0}]
["T",null,null,null,"totaal",{"$f":"SUM(F66:F74)","v":0},{"$f":"SUM(G66:G74)","v":0},{"$f":"SUM(H66:H74)","v":0},"looprek",{"$f":"COUNTIF(P$3:P$52,I75)","v":0},0,null,"plafondlift",{"$f":"COUNTIF(N$3:N$52,M75)","v":0},0]
[null,null,null,null,null,null,null,null,"rollator",{"$f":"COUNTIF(P$3:P$52,I76)","v":0},0,null,"totaal",{"$f":"SUM(N74:N75)","v":0},0,0]
[null,null,null,null,"Hoog-laag","aantal gebruikt","aantal aanwezg","vereist aantal","wandelstok",{"$f":"COUNTIF(P$3:P$52,I77)","v":0},0]
[null,null,null,null,"bed",{"$f":"J53","v":0},null,{"$f":"SUM($B55:$B58)","v":0},"totaal",{"$f":"SUM(J74:J77)","v":0},{"$f":"SUM(K74:K77)","v":0},{"$f":"SUM(L74:L77)","v":0},"steunkousen","aantal gebruikt","aantal beschikbaar","vereist aantal"]
[null,null,null,null,"douchestoel",{"$f":"'detail wasgebeuren'!G60","v":0},null,{"$f":"'detail wasgebeuren'!F60","v":0},null,null,"enkel groene velden",null,"glijkous",{"$f":"COUNTIF('detail wasgebeuren'!E$3:E$52,M79)","v":0},0,{"$f":"'detail wasgebeuren'!E61","v":0}]
[null,null,null,null,"bad",{"$f":"'detail wasgebeuren'!K60","v":0},null,{"$f":"'detail wasgebeuren'!J60","v":0},null,null,"in te vullen",null,"beugel",{"$f":"COUNTIF('detail wasgebeuren'!E$3:E$52,M80)","v":0},0]
[null,null,null,null,"douchebrancard",{"$f":"'detail wasgebeuren'!I60","v":0},null,{"$f":"'detail wasgebeuren'!H60","v":0},null,null,null,null,"totaal",{"$f":"SUM(N79:N80)","v":0},{"$f":"SUM(O79:O80)","v":0},{"$f":"SUM(P79:P80)","v":0}]
[null,null,null,null,"totaal",{"$f":"SUM(F78:F81)","v":0},{"$f":"SUM(G78:G81)","v":0},{"$f":"SUM(H78:H81)","v":0}]
[null,null,null,null,null,null,null,null,"In deze tabellen worden aantal gebruikte automatisch opgeteld. U vult enkel de aanwezige aantallen in bij de groene velden. "]

{"sheet":"detail wasgebeuren","index":3,"n_rows":63,"n_cols":11,"rows_kept":63,"cut":false,"hidden":false,"merged":[[0,3,0,4],[0,5,0,6],[0,7,0,8],[0,9,0,10]]}
["N Pt",null,null,"steunkousen",null,"zittend douchen/ wassen ",null,"liggend douchen",null,"baden "]
["Cliënt","Klasse","BMI","steunkousen ","hulpmiddel steunkousen","wassen/douchen zittende cliënt","gebruik hoog-laag douchestoel","liggend douchen","hoog-laag douchebrancard","baden","hoog-laag bad /badstoel"]
[{"$f":"INVULBLAD!$C1","v":1},{"$f":"INVULBLAD!C2","v":"Vrij"},{"$f":"INVULBLAD!$C5","v":""},{"$f":"INVULBLAD!$C17","v":"nee"},{"$f":"INVULBLAD!$C18","v":"geen"},{"$f":"INVULBLAD!$C19","v":"nee"},{"$f":"INVULBLAD!$C20","v":"nee"},{"$f":"INVULBLAD!$C21","v":"nee"},{"$f":"INVULBLAD!$C22","v":"nee"},{"$f":"INVULBLAD!$C23","v":"nee"},{"$f":"INVULBLAD!$C24","v":"nee"}]
[{"$f":"INVULBLAD!$D1","v":2},{"$f":"INVULBLAD!$D2","v":"Vrij"},{"$f":"INVULBLAD!$D5","v":""},{"$f":"INVULBLAD!$D17","v":"nee"},{"$f":"INVULBLAD!$D18","v":"geen"},{"$f":"INVULBLAD!$D19","v":"nee"},{"$f":"INVULBLAD!$D20","v":"nee"},{"$f":"INVULBLAD!$D21","v":"nee"},{"$f":"INVULBLAD!$D22","v":"nee"},{"$f":"INVULBLAD!$D23","v":"nee"},{"$f":"INVULBLAD!$D24","v":"nee"}]
[{"$f":"INVULBLAD!$E1","v":3},{"$f":"INVULBLAD!$E2","v":"Vrij"},{"$f":"INVULBLAD!$E5","v":""},{"$f":"INVULBLAD!$E17","v":"nee"},{"$f":"INVULBLAD!$E18","v":"geen"},{"$f":"INVULBLAD!$E19","v":"nee"},{"$f":"INVULBLAD!$E20","v":"nee"},{"$f":"INVULBLAD!$E21","v":"nee"},{"$f":"INVULBLAD!$E22","v":"nee"},{"$f":"INVULBLAD!$E23","v":"nee"},{"$f":"INVULBLAD!$E24","v":"nee"}]
[{"$f":"INVULBLAD!$F1","v":4},{"$f":"INVULBLAD!$F2","v":"Vrij"},{"$f":"INVULBLAD!$F5","v":""},{"$f":"INVULBLAD!$F17","v":"nee"},{"$f":"INVULBLAD!$F18","v":"geen"},{"$f":"INVULBLAD!$F19","v":"nee"},{"$f":"INVULBLAD!$F20","v":"nee"},{"$f":"INVULBLAD!$F21","v":"nee"},{"$f":"INVULBLAD!$F22","v":"nee"},{"$f":"INVULBLAD!$F23","v":"nee"},{"$f":"INVULBLAD!$F24","v":"nee"}]
[{"$f":"INVULBLAD!$G1","v":5},{"$f":"INVULBLAD!$G2","v":"Vrij"},{"$f":"INVULBLAD!$G5","v":""},{"$f":"INVULBLAD!$G17","v":"nee"},{"$f":"INVULBLAD!$G18","v":"geen"},{"$f":"INVULBLAD!$G19","v":"nee"},{"$f":"INVULBLAD!$G20","v":"nee"},{"$f":"INVULBLAD!$G21","v":"nee"},{"$f":"INVULBLAD!$G22","v":"nee"},{"$f":"INVULBLAD!$G23","v":"nee"},{"$f":"INVULBLAD!$G24","v":"nee"}]
[{"$f":"INVULBLAD!$H1","v":6},{"$f":"INVULBLAD!$H2","v":"Vrij"},{"$f":"INVULBLAD!$H5","v":""},{"$f":"INVULBLAD!$H17","v":"nee"},{"$f":"INVULBLAD!$H18","v":"geen"},{"$f":"INVULBLAD!$H19","v":"nee"},{"$f":"INVULBLAD!$H20","v":"nee"},{"$f":"INVULBLAD!$H21","v":"nee"},{"$f":"INVULBLAD!$H22","v":"nee"},{"$f":"INVULBLAD!$H23","v":"nee"},{"$f":"INVULBLAD!$H24","v":"nee"}]
[{"$f":"INVULBLAD!$I1","v":7},{"$f":"INVULBLAD!$I2","v":"Vrij"},{"$f":"INVULBLAD!$I5","v":""},{"$f":"INVULBLAD!$I17","v":"nee"},{"$f":"INVULBLAD!$I18","v":"geen"},{"$f":"INVULBLAD!$I19","v":"nee"},{"$f":"INVULBLAD!$I20","v":"nee"},{"$f":"INVULBLAD!$I21","v":"nee"},{"$f":"INVULBLAD!$I22","v":"nee"},{"$f":"INVULBLAD!$I23","v":"nee"},{"$f":"INVULBLAD!$I24","v":"nee"}]
[{"$f":"INVULBLAD!$J1","v":8},{"$f":"INVULBLAD!$J2","v":"Vrij"},{"$f":"INVULBLAD!$J5","v":""},{"$f":"INVULBLAD!$J17","v":"nee"},{"$f":"INVULBLAD!$J18","v":"geen"},{"$f":"INVULBLAD!$J19","v":"nee"},{"$f":"INVULBLAD!$J20","v":"nee"},{"$f":"INVULBLAD!$J21","v":"nee"},{"$f":"INVULBLAD!$J22","v":"nee"},{"$f":"INVULBLAD!$J23","v":"nee"},{"$f":"INVULBLAD!$J24","v":"nee"}]
[{"$f":"INVULBLAD!$K1","v":9},{"$f":"INVULBLAD!$K2","v":"Vrij"},{"$f":"INVULBLAD!$K5","v":""},{"$f":"INVULBLAD!$K17","v":"nee"},{"$f":"INVULBLAD!$K18","v":"geen"},{"$f":"INVULBLAD!$K19","v":"nee"},{"$f":"INVULBLAD!$K20","v":"nee"},{"$f":"INVULBLAD!$K21","v":"nee"},{"$f":"INVULBLAD!$K22","v":"nee"},{"$f":"INVULBLAD!$K23","v":"nee"},{"$f":"INVULBLAD!$K24","v":"nee"}]
[{"$f":"INVULBLAD!$L1","v":10},{"$f":"INVULBLAD!$L2","v":"Vrij"},{"$f":"INVULBLAD!$L5","v":""},{"$f":"INVULBLAD!$L17","v":"nee"},{"$f":"INVULBLAD!$L18","v":"geen"},{"$f":"INVULBLAD!$L19","v":"nee"},{"$f":"INVULBLAD!$L20","v":"nee"},{"$f":"INVULBLAD!$L21","v":"nee"},{"$f":"INVULBLAD!$L22","v":"nee"},{"$f":"INVULBLAD!$L23","v":"nee"},{"$f":"INVULBLAD!$L24","v":"nee"}]
[{"$f":"INVULBLAD!$M1","v":11},{"$f":"INVULBLAD!$M2","v":"Vrij"},{"$f":"INVULBLAD!$M5","v":""},{"$f":"INVULBLAD!$M17","v":"nee"},{"$f":"INVULBLAD!$M18","v":"geen"},{"$f":"INVULBLAD!$M19","v":"nee"},{"$f":"INVULBLAD!$M20","v":"nee"},{"$f":"INVULBLAD!$M21","v":"nee"},{"$f":"INVULBLAD!$M22","v":"nee"},{"$f":"INVULBLAD!$M23","v":"nee"},{"$f":"INVULBLAD!$M24","v":"nee"}]
[{"$f":"INVULBLAD!$N1","v":12},{"$f":"INVULBLAD!$N2","v":"Vrij"},{"$f":"INVULBLAD!$N5","v":""},{"$f":"INVULBLAD!$N17","v":"nee"},{"$f":"INVULBLAD!$N18","v":"geen"},{"$f":"INVULBLAD!$N19","v":"nee"},{"$f":"INVULBLAD!$N20","v":"nee"},{"$f":"INVULBLAD!$N21","v":"nee"},{"$f":"INVULBLAD!$N22","v":"nee"},{"$f":"INVULBLAD!$N23","v":"nee"},{"$f":"INVULBLAD!$N24","v":"nee"}]
[{"$f":"INVULBLAD!$O1","v":13},{"$f":"INVULBLAD!$O2","v":"Vrij"},{"$f":"INVULBLAD!$O5","v":""},{"$f":"INVULBLAD!$O17","v":"nee"},{"$f":"INVULBLAD!$O18","v":"geen"},{"$f":"INVULBLAD!$O19","v":"nee"},{"$f":"INVULBLAD!$O20","v":"nee"},{"$f":"INVULBLAD!$O21","v":"nee"},{"$f":"INVULBLAD!$O22","v":"nee"},{"$f":"INVULBLAD!$O23","v":"nee"},{"$f":"INVULBLAD!$O24","v":"nee"}]
[{"$f":"INVULBLAD!$P1","v":14},{"$f":"INVULBLAD!$P2","v":"Vrij"},{"$f":"INVULBLAD!$P5","v":""},{"$f":"INVULBLAD!$P17","v":"nee"},{"$f":"INVULBLAD!$P18","v":"geen"},{"$f":"INVULBLAD!$P19","v":"nee"},{"$f":"INVULBLAD!$P20","v":"nee"},{"$f":"INVULBLAD!$P21","v":"nee"},{"$f":"INVULBLAD!$P22","v":"nee"},{"$f":"INVULBLAD!$P23","v":"nee"},{"$f":"INVULBLAD!$P24","v":"nee"}]
[{"$f":"INVULBLAD!$Q1","v":15},{"$f":"INVULBLAD!$Q2","v":"Vrij"},{"$f":"INVULBLAD!$Q5","v":""},{"$f":"INVULBLAD!$Q17","v":"nee"},{"$f":"INVULBLAD!$Q18","v":"geen"},{"$f":"INVULBLAD!$Q19","v":"nee"},{"$f":"INVULBLAD!$Q20","v":"nee"},{"$f":"INVULBLAD!$Q21","v":"nee"},{"$f":"INVULBLAD!$Q22","v":"nee"},{"$f":"INVULBLAD!$Q23","v":"nee"},{"$f":"INVULBLAD!$Q24","v":"nee"}]
[{"$f":"INVULBLAD!$R1","v":16},{"$f":"INVULBLAD!$R2","v":"Vrij"},{"$f":"INVULBLAD!$R5","v":""},{"$f":"INVULBLAD!$R17","v":"nee"},{"$f":"INVULBLAD!$R18","v":"geen"},{"$f":"INVULBLAD!$R19","v":"nee"},{"$f":"INVULBLAD!$R20","v":"nee"},{"$f":"INVULBLAD!$R21","v":"nee"},{"$f":"INVULBLAD!$R22","v":"nee"},{"$f":"INVULBLAD!$R23","v":"nee"},{"$f":"INVULBLAD!$R24","v":"nee"}]
[{"$f":"INVULBLAD!$S1","v":17},{"$f":"INVULBLAD!$S2","v":"Vrij"},{"$f":"INVULBLAD!$S5","v":""},{"$f":"INVULBLAD!$S17","v":"nee"},{"$f":"INVULBLAD!$S18","v":"geen"},{"$f":"INVULBLAD!$S19","v":"nee"},{"$f":"INVULBLAD!$S20","v":"nee"},{"$f":"INVULBLAD!$S21","v":"nee"},{"$f":"INVULBLAD!$S22","v":"nee"},{"$f":"INVULBLAD!$S23","v":"nee"},{"$f":"INVULBLAD!$S24","v":"nee"}]
[{"$f":"INVULBLAD!$T1","v":18},{"$f":"INVULBLAD!$T2","v":"Vrij"},{"$f":"INVULBLAD!$T5","v":""},{"$f":"INVULBLAD!$T17","v":"nee"},{"$f":"INVULBLAD!$T18","v":"geen"},{"$f":"INVULBLAD!$T19","v":"nee"},{"$f":"INVULBLAD!$T20","v":"nee"},{"$f":"INVULBLAD!$T21","v":"nee"},{"$f":"INVULBLAD!$T22","v":"nee"},{"$f":"INVULBLAD!$T23","v":"nee"},{"$f":"INVULBLAD!$T24","v":"nee"}]
[{"$f":"INVULBLAD!$U1","v":19},{"$f":"INVULBLAD!$U2","v":"Vrij"},{"$f":"INVULBLAD!$U5","v":""},{"$f":"INVULBLAD!$U17","v":"nee"},{"$f":"INVULBLAD!$U18","v":"geen"},{"$f":"INVULBLAD!$U19","v":"nee"},{"$f":"INVULBLAD!$U20","v":"nee"},{"$f":"INVULBLAD!$U21","v":"nee"},{"$f":"INVULBLAD!$U22","v":"nee"},{"$f":"INVULBLAD!$U23","v":"nee"},{"$f":"INVULBLAD!$U24","v":"nee"}]
[{"$f":"INVULBLAD!$V1","v":20},{"$f":"INVULBLAD!$V2","v":"Vrij"},{"$f":"INVULBLAD!$V5","v":""},{"$f":"INVULBLAD!$V17","v":"nee"},{"$f":"INVULBLAD!$V18","v":"geen"},{"$f":"INVULBLAD!$V19","v":"nee"},{"$f":"INVULBLAD!$V20","v":"nee"},{"$f":"INVULBLAD!$V21","v":"nee"},{"$f":"INVULBLAD!$V22","v":"nee"},{"$f":"INVULBLAD!$V23","v":"nee"},{"$f":"INVULBLAD!$V24","v":"nee"}]
[{"$f":"INVULBLAD!$W1","v":21},{"$f":"INVULBLAD!$W2","v":"Vrij"},{"$f":"INVULBLAD!$W5","v":""},{"$f":"INVULBLAD!$W17","v":"nee"},{"$f":"INVULBLAD!$W18","v":"geen"},{"$f":"INVULBLAD!$W19","v":"nee"},{"$f":"INVULBLAD!$W20","v":"nee"},{"$f":"INVULBLAD!$W21","v":"nee"},{"$f":"INVULBLAD!$W22","v":"nee"},{"$f":"INVULBLAD!$W23","v":"nee"},{"$f":"INVULBLAD!$W24","v":"nee"}]
[{"$f":"INVULBLAD!$X1","v":22},{"$f":"INVULBLAD!$X2","v":"Vrij"},{"$f":"INVULBLAD!$X5","v":""},{"$f":"INVULBLAD!$X17","v":"nee"},{"$f":"INVULBLAD!$X18","v":"geen"},{"$f":"INVULBLAD!$X19","v":"nee"},{"$f":"INVULBLAD!$X20","v":"nee"},{"$f":"INVULBLAD!$X21","v":"nee"},{"$f":"INVULBLAD!$X22","v":"nee"},{"$f":"INVULBLAD!$X23","v":"nee"},{"$f":"INVULBLAD!$X24","v":"nee"}]
[{"$f":"INVULBLAD!$Y1","v":23},{"$f":"INVULBLAD!$Y2","v":"Vrij"},{"$f":"INVULBLAD!$Y5","v":""},{"$f":"INVULBLAD!$Y17","v":"nee"},{"$f":"INVULBLAD!$Y18","v":"geen"},{"$f":"INVULBLAD!$Y19","v":"nee"},{"$f":"INVULBLAD!$Y20","v":"nee"},{"$f":"INVULBLAD!$Y21","v":"nee"},{"$f":"INVULBLAD!$Y22","v":"nee"},{"$f":"INVULBLAD!$Y23","v":"nee"},{"$f":"INVULBLAD!$Y24","v":"nee"}]
[{"$f":"INVULBLAD!$Z1","v":24},{"$f":"INVULBLAD!$Z2","v":"Vrij"},{"$f":"INVULBLAD!$Z5","v":""},{"$f":"INVULBLAD!$Z17","v":"nee"},{"$f":"INVULBLAD!$Z18","v":"geen"},{"$f":"INVULBLAD!$Z19","v":"nee"},{"$f":"INVULBLAD!$Z20","v":"nee"},{"$f":"INVULBLAD!$Z21","v":"nee"},{"$f":"INVULBLAD!$Z22","v":"nee"},{"$f":"INVULBLAD!$Z23","v":"nee"},{"$f":"INVULBLAD!$Z24","v":"nee"}]
[{"$f":"INVULBLAD!$AA1","v":25},{"$f":"INVULBLAD!$AA2","v":"Vrij"},{"$f":"INVULBLAD!$AA5","v":""},{"$f":"INVULBLAD!$AA17","v":"nee"},{"$f":"INVULBLAD!$AA18","v":"geen"},{"$f":"INVULBLAD!$AA19","v":"nee"},{"$f":"INVULBLAD!$AA20","v":"nee"},{"$f":"INVULBLAD!$AA21","v":"nee"},{"$f":"INVULBLAD!$AA22","v":"nee"},{"$f":"INVULBLAD!$AA23","v":"nee"},{"$f":"INVULBLAD!$AA24","v":"nee"}]
[{"$f":"INVULBLAD!$AB1","v":26},{"$f":"INVULBLAD!$AB2","v":"Vrij"},{"$f":"INVULBLAD!$AB5","v":""},{"$f":"INVULBLAD!$AB17","v":"nee"},{"$f":"INVULBLAD!$AB18","v":"geen"},{"$f":"INVULBLAD!$AB19","v":"nee"},{"$f":"INVULBLAD!$AB20","v":"nee"},{"$f":"INVULBLAD!$AB21","v":"nee"},{"$f":"INVULBLAD!$AB22","v":"nee"},{"$f":"INVULBLAD!$AB23","v":"nee"},{"$f":"INVULBLAD!$AB24","v":"nee"}]
[{"$f":"INVULBLAD!$AC1","v":27},{"$f":"INVULBLAD!$AC2","v":"Vrij"},{"$f":"INVULBLAD!$AC5","v":""},{"$f":"INVULBLAD!$AC17","v":"nee"},{"$f":"INVULBLAD!$AC18","v":"geen"},{"$f":"INVULBLAD!$AC19","v":"nee"},{"$f":"INVULBLAD!$AC20","v":"nee"},{"$f":"INVULBLAD!$AC21","v":"nee"},{"$f":"INVULBLAD!$AC22","v":"nee"},{"$f":"INVULBLAD!$AC23","v":"nee"},{"$f":"INVULBLAD!$AC24","v":"nee"}]
[{"$f":"INVULBLAD!$AD1","v":28},{"$f":"INVULBLAD!$AD2","v":"Vrij"},{"$f":"INVULBLAD!$AD5","v":""},{"$f":"INVULBLAD!$AD17","v":"nee"},{"$f":"INVULBLAD!$AD18","v":"geen"},{"$f":"INVULBLAD!$AD19","v":"nee"},{"$f":"INVULBLAD!$AD20","v":"nee"},{"$f":"INVULBLAD!$AD21","v":"nee"},{"$f":"INVULBLAD!$AD22","v":"nee"},{"$f":"INVULBLAD!$AD23","v":"nee"},{"$f":"INVULBLAD!$AD24","v":"nee"}]
[{"$f":"INVULBLAD!$AE1","v":29},{"$f":"INVULBLAD!$AE2","v":"Vrij"},{"$f":"INVULBLAD!$AE5","v":""},{"$f":"INVULBLAD!$AE17","v":"nee"},{"$f":"INVULBLAD!$AE18","v":"geen"},{"$f":"INVULBLAD!$AE19","v":"nee"},{"$f":"INVULBLAD!$AE20","v":"nee"},{"$f":"INVULBLAD!$AE21","v":"nee"},{"$f":"INVULBLAD!$AE22","v":"nee"},{"$f":"INVULBLAD!$AE23","v":"nee"},{"$f":"INVULBLAD!$AE24","v":"nee"}]
[{"$f":"INVULBLAD!$AF1","v":30},{"$f":"INVULBLAD!$AF2","v":"Vrij"},{"$f":"INVULBLAD!$AF5","v":""},{"$f":"INVULBLAD!$AF17","v":"nee"},{"$f":"INVULBLAD!$AF18","v":"geen"},{"$f":"INVULBLAD!$AF19","v":"nee"},{"$f":"INVULBLAD!$AF20","v":"nee"},{"$f":"INVULBLAD!$AF21","v":"nee"},{"$f":"INVULBLAD!$AF22","v":"nee"},{"$f":"INVULBLAD!$AF23","v":"nee"},{"$f":"INVULBLAD!$AF24","v":"nee"}]
[{"$f":"INVULBLAD!$AG1","v":31},{"$f":"INVULBLAD!$AG2","v":"Vrij"},{"$f":"INVULBLAD!$AG5","v":""},{"$f":"INVULBLAD!$AG17","v":"nee"},{"$f":"INVULBLAD!$AG18","v":"geen"},{"$f":"INVULBLAD!$AG19","v":"nee"},{"$f":"INVULBLAD!$AG20","v":"nee"},{"$f":"INVULBLAD!$AG21","v":"nee"},{"$f":"INVULBLAD!$AG22","v":"nee"},{"$f":"INVULBLAD!$AG23","v":"nee"},{"$f":"INVULBLAD!$AG24","v":"nee"}]
[{"$f":"INVULBLAD!$AH1","v":32},{"$f":"INVULBLAD!$AH2","v":"Vrij"},{"$f":"INVULBLAD!$AH5","v":""},{"$f":"INVULBLAD!$AH17","v":"nee"},{"$f":"INVULBLAD!$AH18","v":"geen"},{"$f":"INVULBLAD!$AH19","v":"nee"},{"$f":"INVULBLAD!$AH20","v":"nee"},{"$f":"INVULBLAD!$AH21","v":"nee"},{"$f":"INVULBLAD!$AH22","v":"nee"},{"$f":"INVULBLAD!$AH23","v":"nee"},{"$f":"INVULBLAD!$AH24","v":"nee"}]
[{"$f":"INVULBLAD!$AI1","v":33},{"$f":"INVULBLAD!$AI2","v":"Vrij"},{"$f":"INVULBLAD!$AI5","v":""},{"$f":"INVULBLAD!$AI17","v":"nee"},{"$f":"INVULBLAD!$AI18","v":"geen"},{"$f":"INVULBLAD!$AI19","v":"nee"},{"$f":"INVULBLAD!$AI20","v":"nee"},{"$f":"INVULBLAD!$AI21","v":"nee"},{"$f":"INVULBLAD!$AI22","v":"nee"},{"$f":"INVULBLAD!$AI23","v":"nee"},{"$f":"INVULBLAD!$AI24","v":"nee"}]
[{"$f":"INVULBLAD!$AJ1","v":34},{"$f":"INVULBLAD!$AJ2","v":"Vrij"},{"$f":"INVULBLAD!$AJ5","v":""},{"$f":"INVULBLAD!$AJ17","v":"nee"},{"$f":"INVULBLAD!$AJ18","v":"geen"},{"$f":"INVULBLAD!$AJ19","v":"nee"},{"$f":"INVULBLAD!$AJ20","v":"nee"},{"$f":"INVULBLAD!$AJ21","v":"nee"},{"$f":"INVULBLAD!$AJ22","v":"nee"},{"$f":"INVULBLAD!$AJ23","v":"nee"},{"$f":"INVULBLAD!$AJ24","v":"nee"}]
[{"$f":"INVULBLAD!$AK1","v":35},{"$f":"INVULBLAD!$AK2","v":"Vrij"},{"$f":"INVULBLAD!$AK5","v":""},{"$f":"INVULBLAD!$AK17","v":"nee"},{"$f":"INVULBLAD!$AK18","v":"geen"},{"$f":"INVULBLAD!$AK19","v":"nee"},{"$f":"INVULBLAD!$AK20","v":"nee"},{"$f":"INVULBLAD!$AK21","v":"nee"},{"$f":"INVULBLAD!$AK22","v":"nee"},{"$f":"INVULBLAD!$AK23","v":"nee"},{"$f":"INVULBLAD!$AK24","v":"nee"}]
[{"$f":"INVULBLAD!$AL1","v":36},{"$f":"INVULBLAD!$AL2","v":"Vrij"},{"$f":"INVULBLAD!$AL5","v":""},{"$f":"INVULBLAD!$AL17","v":"nee"},{"$f":"INVULBLAD!$AL18","v":"geen"},{"$f":"INVULBLAD!$AL19","v":"nee"},{"$f":"INVULBLAD!$AL20","v":"nee"},{"$f":"INVULBLAD!$AL21","v":"nee"},{"$f":"INVULBLAD!$AL22","v":"nee"},{"$f":"INVULBLAD!$AL23","v":"nee"},{"$f":"INVULBLAD!$AL24","v":"nee"}]
[{"$f":"INVULBLAD!$AM1","v":37},{"$f":"INVULBLAD!$AM2","v":"Vrij"},{"$f":"INVULBLAD!$AM5","v":""},{"$f":"INVULBLAD!$AM17","v":"nee"},{"$f":"INVULBLAD!$AM18","v":"geen"},{"$f":"INVULBLAD!$AM19","v":"nee"},{"$f":"INVULBLAD!$AM20","v":"nee"},{"$f":"INVULBLAD!$AM21","v":"nee"},{"$f":"INVULBLAD!$AM22","v":"nee"},{"$f":"INVULBLAD!$AM23","v":"nee"},{"$f":"INVULBLAD!$AM24","v":"nee"}]
[{"$f":"INVULBLAD!$AN1","v":38},{"$f":"INVULBLAD!$AN2","v":"Vrij"},{"$f":"INVULBLAD!$AN5","v":""},{"$f":"INVULBLAD!$AN17","v":"nee"},{"$f":"INVULBLAD!$AN18","v":"geen"},{"$f":"INVULBLAD!$AN19","v":"nee"},{"$f":"INVULBLAD!$AN20","v":"nee"},{"$f":"INVULBLAD!$AN21","v":"nee"},{"$f":"INVULBLAD!$AN22","v":"nee"},{"$f":"INVULBLAD!$AN23","v":"nee"},{"$f":"INVULBLAD!$AN24","v":"nee"}]
[{"$f":"INVULBLAD!$AO1","v":39},{"$f":"INVULBLAD!$AO2","v":"Vrij"},{"$f":"INVULBLAD!$AO5","v":""},{"$f":"INVULBLAD!$AO17","v":"nee"},{"$f":"INVULBLAD!$AO18","v":"geen"},{"$f":"INVULBLAD!$AO19","v":"nee"},{"$f":"INVULBLAD!$AO20","v":"nee"},{"$f":"INVULBLAD!$AO21","v":"nee"},{"$f":"INVULBLAD!$AO22","v":"nee"},{"$f":"INVULBLAD!$AO23","v":"nee"},{"$f":"INVULBLAD!$AO24","v":"nee"}]
[{"$f":"INVULBLAD!$AP1","v":40},{"$f":"INVULBLAD!$AP2","v":"Vrij"},{"$f":"INVULBLAD!$AP5","v":""},{"$f":"INVULBLAD!$AP17","v":"nee"},{"$f":"INVULBLAD!$AP18","v":"geen"},{"$f":"INVULBLAD!$AP19","v":"nee"},{"$f":"INVULBLAD!$AP20","v":"nee"},{"$f":"INVULBLAD!$AP21","v":"nee"},{"$f":"INVULBLAD!$AP22","v":"nee"},{"$f":"INVULBLAD!$AP23","v":"nee"},{"$f":"INVULBLAD!$AP24","v":"nee"}]
[{"$f":"INVULBLAD!$AQ1","v":41},{"$f":"INVULBLAD!$AQ2","v":"Vrij"},{"$f":"INVULBLAD!$AQ5","v":""},{"$f":"INVULBLAD!$AQ17","v":"nee"},{"$f":"INVULBLAD!$AQ18","v":"geen"},{"$f":"INVULBLAD!$AQ19","v":"nee"},{"$f":"INVULBLAD!$AQ20","v":"nee"},{"$f":"INVULBLAD!$AQ21","v":"nee"},{"$f":"INVULBLAD!$AQ22","v":"nee"},{"$f":"INVULBLAD!$AQ23","v":"nee"},{"$f":"INVULBLAD!$AQ24","v":"nee"}]
[{"$f":"INVULBLAD!$AR1","v":42},{"$f":"INVULBLAD!$AR2","v":"Vrij"},{"$f":"INVULBLAD!$AR5","v":""},{"$f":"INVULBLAD!$AR17","v":"nee"},{"$f":"INVULBLAD!$AR18","v":"geen"},{"$f":"INVULBLAD!$AR19","v":"nee"},{"$f":"INVULBLAD!$AR20","v":"nee"},{"$f":"INVULBLAD!$AR21","v":"nee"},{"$f":"INVULBLAD!$AR22","v":"nee"},{"$f":"INVULBLAD!$AR23","v":"nee"},{"$f":"INVULBLAD!$AR24","v":"nee"}]
[{"$f":"INVULBLAD!$AS1","v":43},{"$f":"INVULBLAD!$AS2","v":"Vrij"},{"$f":"INVULBLAD!$AS5","v":""},{"$f":"INVULBLAD!$AS17","v":"nee"},{"$f":"INVULBLAD!$AS18","v":"geen"},{"$f":"INVULBLAD!$AS19","v":"nee"},{"$f":"INVULBLAD!$AS20","v":"nee"},{"$f":"INVULBLAD!$AS21","v":"nee"},{"$f":"INVULBLAD!$AS22","v":"nee"},{"$f":"INVULBLAD!$AS23","v":"nee"},{"$f":"INVULBLAD!$AS24","v":"nee"}]
[{"$f":"INVULBLAD!$AT1","v":44},{"$f":"INVULBLAD!$AT2","v":"Vrij"},{"$f":"INVULBLAD!$AT5","v":""},{"$f":"INVULBLAD!$AT17","v":"nee"},{"$f":"INVULBLAD!$AT18","v":"geen"},{"$f":"INVULBLAD!$AT19","v":"nee"},{"$f":"INVULBLAD!$AT20","v":"nee"},{"$f":"INVULBLAD!$AT21","v":"nee"},{"$f":"INVULBLAD!$AT22","v":"nee"},{"$f":"INVULBLAD!$AT23","v":"nee"},{"$f":"INVULBLAD!$AT24","v":"nee"}]
[{"$f":"INVULBLAD!$AU1","v":45},{"$f":"INVULBLAD!$AU2","v":"Vrij"},{"$f":"INVULBLAD!$AU5","v":""},{"$f":"INVULBLAD!$AU17","v":"nee"},{"$f":"INVULBLAD!$AU18","v":"geen"},{"$f":"INVULBLAD!$AU19","v":"nee"},{"$f":"INVULBLAD!$AU20","v":"nee"},{"$f":"INVULBLAD!$AU21","v":"nee"},{"$f":"INVULBLAD!$AU22","v":"nee"},{"$f":"INVULBLAD!$AU23","v":"nee"},{"$f":"INVULBLAD!$AU24","v":"nee"}]
[{"$f":"INVULBLAD!$AV1","v":46},{"$f":"INVULBLAD!$AV2","v":"Vrij"},{"$f":"INVULBLAD!$AV5","v":""},{"$f":"INVULBLAD!$AV17","v":"nee"},{"$f":"INVULBLAD!$AV18","v":"geen"},{"$f":"INVULBLAD!$AV19","v":"nee"},{"$f":"INVULBLAD!$AV20","v":"nee"},{"$f":"INVULBLAD!$AV21","v":"nee"},{"$f":"INVULBLAD!$AV22","v":"nee"},{"$f":"INVULBLAD!$AV23","v":"nee"},{"$f":"INVULBLAD!$AV24","v":"nee"}]
[{"$f":"INVULBLAD!$AW1","v":47},{"$f":"INVULBLAD!$AW2","v":"Vrij"},{"$f":"INVULBLAD!$AW5","v":""},{"$f":"INVULBLAD!$AW17","v":"nee"},{"$f":"INVULBLAD!$AW18","v":"geen"},{"$f":"INVULBLAD!$AW19","v":"nee"},{"$f":"INVULBLAD!$AW20","v":"nee"},{"$f":"INVULBLAD!$AW21","v":"nee"},{"$f":"INVULBLAD!$AW22","v":"nee"},{"$f":"INVULBLAD!$AW23","v":"nee"},{"$f":"INVULBLAD!$AW24","v":"nee"}]
[{"$f":"INVULBLAD!$AX1","v":48},{"$f":"INVULBLAD!$AX2","v":"Vrij"},{"$f":"INVULBLAD!$AX5","v":""},{"$f":"INVULBLAD!$AX17","v":"nee"},{"$f":"INVULBLAD!$AX18","v":"geen"},{"$f":"INVULBLAD!$AX19","v":"nee"},{"$f":"INVULBLAD!$AX20","v":"nee"},{"$f":"INVULBLAD!$AX21","v":"nee"},{"$f":"INVULBLAD!$AX22","v":"nee"},{"$f":"INVULBLAD!$AX23","v":"nee"},{"$f":"INVULBLAD!$AX24","v":"nee"}]
[{"$f":"INVULBLAD!$AY1","v":49},{"$f":"INVULBLAD!$AY2","v":"Vrij"},{"$f":"INVULBLAD!$AY5","v":""},{"$f":"INVULBLAD!$AY17","v":"nee"},{"$f":"INVULBLAD!$AY18","v":"geen"},{"$f":"INVULBLAD!$AY19","v":"nee"},{"$f":"INVULBLAD!$AY20","v":"nee"},{"$f":"INVULBLAD!$AY21","v":"nee"},{"$f":"INVULBLAD!$AY22","v":"nee"},{"$f":"INVULBLAD!$AY23","v":"nee"},{"$f":"INVULBLAD!$AY24","v":"nee"}]
[{"$f":"INVULBLAD!$AZ1","v":50},{"$f":"INVULBLAD!$AZ2","v":"Vrij"},{"$f":"INVULBLAD!$AZ5","v":""},{"$f":"INVULBLAD!$AZ17","v":"nee"},{"$f":"INVULBLAD!$AZ18","v":"geen"},{"$f":"INVULBLAD!$AZ19","v":"nee"},{"$f":"INVULBLAD!$AZ20","v":"nee"},{"$f":"INVULBLAD!$AZ21","v":"nee"},{"$f":"INVULBLAD!$AZ22","v":"nee"},{"$f":"INVULBLAD!$AZ23","v":"nee"},{"$f":"INVULBLAD!$AZ24","v":"nee"}]
[null,{"$f":"SUM(B54:B58)","v":0},"totaal ja",{"$f":"COUNTIF(D3:D52,\"ja\")","v":0},{"$f":"COUNTIF(E3:E52,\"*\")-COUNTIF(E3:E52,\"geen\")","v":0},{"$f":"COUNTIF(F3:F52,\"ja\")","v":0},0,0,0,0,0]
[null,{"$f":"COUNTIF(B3:B52,\"A\")","v":0},"A",{"$f":"COUNTIFS($B$3:$B$52,$C54,D$3:D$52,\"ja\")","v":0},{"$f":"COUNTIFS($B$3:$B$52,$C54,E$3:E$52,'detail transfer'!M$79)+COUNTIFS($B$3:$B$52,$C54,E$3:E$52,'detail transfer'!M$80)","v":0},{"$f":"COUNTIFS($B$3:$B$52,$C54,F$3:F$52,\"ja\")","v":0},0,0,0,0,0]
[null,{"$f":"COUNTIF(B3:B52,\"B\")","v":0},"B",0,{"$f":"COUNTIFS($B$3:$B$52,$C55,E$3:E$52,'detail transfer'!M$79)+COUNTIFS($B$3:$B$52,$C55,E$3:E$52,'detail transfer'!M$80)","v":0},0,0,0,0,0,0]
[null,{"$f":"COUNTIF(B3:B52,\"C\")","v":0},"C",0,{"$f":"COUNTIFS($B$3:$B$52,$C56,E$3:E$52,'detail transfer'!M$79)+COUNTIFS($B$3:$B$52,$C56,E$3:E$52,'detail transfer'!M$80)","v":0},{"$f":"COUNTIFS($B$3:$B$52,$C56,F$3:F$52,\"ja\")","v":0},0,0,0,0,0]
[null,{"$f":"COUNTIF(B3:B52,\"D\")","v":0},"D",0,{"$f":"COUNTIFS($B$3:$B$52,$C57,E$3:E$52,'detail transfer'!M$79)+COUNTIFS($B$3:$B$52,$C57,E$3:E$52,'detail transfer'!M$80)","v":0},{"$f":"COUNTIFS($B$3:$B$52,$C57,F$3:F$52,\"ja\")","v":0},0,0,0,0,0]
[null,{"$f":"COUNTIF(B3:B52,\"E\")","v":0},"E",0,{"$f":"COUNTIFS($B$3:$B$52,$C58,E$3:E$52,'detail transfer'!M$79)+COUNTIFS($B$3:$B$52,$C58,E$3:E$52,'detail transfer'!M$80)","v":0},0,0,0,0,0,0]
[null,{"$f":"50-B53","v":50},"Vrij",0,{"$f":"COUNTIFS($B$3:$B$52,$C59,E$3:E$52,'detail transfer'!M$79)+COUNTIFS($B$3:$B$52,$C59,E$3:E$52,'detail transfer'!M$80)","v":0},0,0,0,0,0,0]
[null,null,"In gebruik",null,{"$f":"SUM(E54:E59)","v":0},null,0,null,{"$f":"SUM(I54:I59)","v":0},null,0]
[null,null,"Terecht nodig",null,{"$f":"D53","v":0},null,{"$f":"SUM($F54:$F58)","v":0},null,{"$f":"SUM($H54:$H58)","v":0},null,{"$f":"SUM($J54:$J58)","v":0}]
[null,null,"Onterecht in gebruik",null,{"$f":"E60-E61","v":0},null,{"$f":"G60-G55-G56-G57-G58-G54","v":0},null,{"$f":"I60-I56-I57-I58-I55-I54","v":0},null,{"$f":"K60-K55-K56-K57-K58-K54","v":0}]
[null,null,"Tekort",null,{"$f":"E61-E54-E55-E56-E57-E58","v":0},null,{"$f":"G61-G55-G56-G57-G58-G54","v":0},null,{"$f":"I61-I56-I57-I58-I55-I54","v":0},null,{"$f":"K61-K54-K55-K56-K57-K58","v":0}]

{"sheet":"Overzichtsblad","index":4,"n_rows":125,"n_cols":25,"rows_kept":125,"cut":false,"hidden":false,"merged":[[125,0,125,28],[121,0,123,25],[124,0,124,25],[121,26,124,28],[0,26,120,28],[64,1,66,1],[65,2,66,2],[70,3,70,4],[68,0,68,14],[73,0,73,14],[87,3,87,14],[91,1,92,10],[103,1,104,4],[106,1,107,5],[12,0,27,0],[16,5,17,5],[19,2,20,2],[22,2,23,2],[12,1,27,1],[12,4,12,6],[26,3,26,4],[25,2,26,2],[25,5,26,5],[25,13,26,13],[22,13,23,13],[17,10,18,14],[23,14,25,14],[19,13,20,13],[16,10,16,14],[20,14,22,14],[14,3,16,4],[16,6,16,8],[17,3,19,4],[19,5,20,5],[23,3,25,4],[23,10,25,12],[22,9,23,9],[22,5,23,5],[25,9,26,9],[20,3,22,4],[20,10,22,12],[26,10,26,12],[26,6,26,8],[19,9,20,9],[39,17,40,17],[42,17,43,17],[37,16,39,16],[33,10,33,14],[30,5,31,5],[30,3,30,4],[44,16,44,24],[29,19,32,19],[29,16,32,18],[29,23,32,23],[36,21,37,21],[34,16,36,16],[33,17,34,17],[36,17,37,17],[37,18,39,20],[40,18,42,20],[29,24,32,24],[33,22,43,23],[36,18,36,20],[33,6,33,8],[34,10,35,14],[29,12,32,14],[36,10,36,12],[36,9,37,9],[50,2,51,2],[37,3,39,4],[44,3,44,14],[43,10,43,12],[42,13,43,13],[40,10,42,12],[39,13,40,13],[36,13,37,13],[29,0,44,0],[29,1,44,1],[46,0,61,0],[56,13,57,13],[61,3,61,14],[53,5,54,5],[50,5,51,5],[30,2,31,2],[36,2,37,2],[40,3,42,4],[43,6,43,8],[54,6,54,8],[34,3,36,4],[36,5,37,5],[42,9,43,9],[37,10,39,12],[74,7,74,9],[65,3,65,4],[82,3,82,14],[80,3,80,4],[81,6,81,12],[39,9,40,9],[43,3,43,4],[42,5,43,5],[40,6,42,8],[37,6,39,8],[48,3,50,4],[46,8,49,10],[46,11,49,11],[46,12,49,14],[46,7,49,7],[50,6,52,14],[54,10,54,14],[53,9,54,9],[81,3,81,4],[79,7,79,8],[46,1,61,1],[47,6,49,6],[46,4,46,6],[47,5,48,5],[56,5,57,5],[59,2,60,2],[54,3,56,4],[64,9,64,14],[64,4,64,6],[64,7,64,8],[51,3,53,4],[59,5,60,5],[60,6,60,12],[60,3,60,4],[56,2,57,2],[53,6,53,8],[55,14,56,14],[57,6,59,12],[59,13,60,13],[57,14,59,14],[53,10,53,14],[53,2,54,2],[57,3,59,4],[55,6,56,12],[64,0,66,0],[80,5,81,5],[76,3,76,4],[77,3,77,14],[78,0,78,14],[76,6,76,12],[75,2,76,2],[79,0,81,0],[80,2,81,2],[79,4,79,6],[69,0,71,0],[74,10,74,14],[74,0,76,0],[74,1,76,1],[72,3,72,14],[71,3,71,4],[65,5,66,5],[66,3,66,4],[65,13,66,13],[67,3,67,14],[66,6,66,12],[69,7,69,9],[69,10,69,14],[65,6,65,12],[12,25,27,25],[26,18,26,20],[33,5,34,5],[33,9,34,9],[12,24,15,24],[25,21,26,21],[22,21,23,21],[29,20,32,22],[30,6,32,6],[29,7,32,7],[29,4,29,6],[31,3,33,4],[12,12,15,14],[12,16,15,18],[12,19,15,19],[12,20,15,22],[29,8,32,10],[29,11,32,11],[17,6,19,8],[23,6,25,8],[16,9,17,9],[34,6,36,8],[27,3,27,14],[20,6,22,8],[87,16,87,24],[79,23,81,23],[84,16,84,17],[80,16,80,20],[82,16,82,24],[53,17,54,17],[56,21,57,21],[43,18,43,20],[40,16,42,16],[55,16,56,20],[46,23,49,23],[57,16,59,20],[50,16,52,21],[46,16,49,18],[46,19,49,19],[46,20,49,22],[74,23,76,23],[62,0,62,25],[79,25,82,25],[39,2,40,2],[42,2,43,2],[84,25,87,25],[80,6,80,12],[80,13,81,13],[1,0,2,9],[7,6,7,9],[29,25,44,25],[84,23,86,23],[68,16,68,24],[73,16,73,24],[78,16,78,24],[83,16,83,24],[69,23,71,23],[40,14,42,14],[37,14,39,14],[39,5,40,5],[4,0,4,5],[6,0,6,5],[1,10,7,14],[4,6,4,9],[6,6,6,9],[5,0,5,5],[3,0,3,5],[13,3,13,4],[13,5,14,5],[13,6,15,6],[5,6,5,9],[23,16,25,16],[7,0,7,5],[10,0,11,3],[28,0,28,25],[19,10,19,12],[12,7,15,7],[12,8,15,10],[13,2,14,2],[11,16,11,24],[5,17,5,19],[10,4,10,14],[11,4,11,14],[12,11,15,11],[16,2,17,2],[7,17,7,19],[0,15,7,16],[0,17,3,24],[4,17,4,24],[6,17,6,24],[5,20,5,24],[7,20,7,24],[10,16,10,24],[0,0,0,14],[0,25,8,25],[3,6,3,9],[112,11,113,12],[84,4,84,6],[86,3,86,4],[100,6,100,9],[100,10,100,12],[100,1,101,5],[109,1,110,5],[112,1,113,2],[113,7,113,10],[113,3,113,6],[110,6,110,12],[101,6,101,12],[94,1,95,8],[93,0,93,13],[109,10,109,12],[112,3,112,6],[112,7,112,10],[97,6,97,9],[112,0,113,0],[85,5,86,5],[85,6,85,12],[85,13,86,13],[103,8,103,11],[106,8,106,11],[69,1,71,1],[69,4,69,6],[70,6,70,12],[70,2,71,2],[71,6,71,12],[70,5,71,5],[70,13,71,13],[109,0,110,0],[97,13,98,13],[103,13,104,13],[106,13,107,13],[84,7,84,10],[84,0,86,0],[91,0,92,0],[97,0,98,0],[85,2,86,2],[88,0,88,14],[96,0,96,13],[90,1,90,13],[94,13,95,13],[83,0,83,14],[79,1,81,1],[79,9,79,14],[74,4,74,6],[118,13,119,13],[115,7,115,10],[114,1,119,6],[85,3,85,4],[89,1,89,13],[86,6,86,12],[84,1,86,1],[91,13,92,13],[84,11,84,14],[89,14,120,14],[120,0,120,13],[115,11,116,12],[102,0,102,13],[97,10,97,12],[97,1,98,5],[98,6,98,12],[94,0,95,0],[109,13,110,13],[108,0,108,13],[106,0,107,0],[103,0,104,0],[111,0,111,13],[114,0,119,0],[118,7,118,10],[80,24,81,24],[80,22,81,22],[69,16,69,17],[70,22,71,22],[80,21,81,21],[79,17,79,22],[81,16,81,20],[75,21,76,21],[71,16,71,20],[70,16,70,20],[72,16,72,24],[65,16,65,20],[65,24,66,24],[66,16,66,20],[65,21,66,21],[67,16,67,24],[74,25,77,25],[74,17,74,22],[70,21,71,21],[69,18,69,22],[77,16,77,24],[70,24,71,24],[76,16,76,20],[75,24,76,24],[115,13,116,13],[119,7,119,10],[8,0,8,24],[33,24,43,24],[53,24,60,24],[50,24,52,24],[45,0,45,25],[46,25,61,25],[47,2,48,2],[47,3,47,4],[46,24,49,24],[33,2,34,2],[61,16,61,24],[60,16,60,20],[53,18,54,21],[59,21,60,21],[50,22,60,23],[12,23,15,23],[19,21,20,21],[64,25,67,25],[64,23,66,23],[69,25,72,25],[64,17,64,22],[65,22,66,22],[109,6,109,9],[63,1,63,25],[75,22,76,22],[75,16,75,20],[75,3,75,4],[75,6,75,12],[75,5,76,5],[75,13,76,13],[85,24,86,24],[85,16,85,20],[85,21,86,21],[84,18,84,22],[85,22,86,22],[86,16,86,20],[105,0,105,13],[100,13,101,13],[100,0,101,0],[88,15,120,25],[99,0,99,13],[118,11,119,12],[114,7,114,13],[117,7,117,13],[116,7,116,10],[112,13,113,13],[9,5,9,6],[9,11,9,12],[9,17,9,18],[9,21,9,24],[9,13,9,16],[9,19,9,20],[9,7,9,10],[9,2,9,4],[42,21,43,21],[39,21,40,21],[33,18,35,21],[23,18,25,20],[27,16,27,24],[20,16,22,16],[20,18,22,20],[19,17,20,17],[16,22,26,23],[25,17,26,17],[22,17,23,17],[16,24,26,24],[16,17,17,17],[17,16,19,16],[16,18,18,21],[19,18,19,20]]}
["VerV  Vlaamse Tilthermometer 1.1"]
["Met dit instrument toets je in hoeverre het werk op je afdeling of hele instelling wordt uitgevoerd volgens de Praktijkrichtlijnen Fysieke Belasting. Met andere woorden, of het werk fysiek gezien niet te zwaar is. "]
[]
["Naam instelling:"]
[]
["Naam/nummer van de locatie/afdeling/groep:",null,null,null,null,null,null,null,null,null,null,null,null,null,null,null,null,"Invuldatum:",null,null,"2018-10-11"]
[]
["Totaal aantal clienten:",null,null,null,null,null,{"$f":"'detail transfer'!B53","v":0},null,null,null,null,null,null,null,null,null,null,"Ingevuld door:"]
[]
[" ",{"$f":"'detail transfer'!B54","v":0},null,null,null,{"$f":"'detail transfer'!B55","v":0},null,null,null,null,null,{"$f":"'detail transfer'!B56","v":0},null,null,null,null,null,{"$f":"'detail transfer'!B57","v":0},null,null,null,{"$f":"'detail transfer'!B58","v":0}]
[null,null,null,null,"Resultaten in cijfers",null,null,null,null,null,null,null,null,null,null,null,"Resultaten in percentages"]
[]
[1,"Transfers van lig naar lig (bed naar (douche) brancard, bed naar bed,  bed naar behandeltafel, …)","mobiliteit van de client",null,"aantal clienten op wie de zorgtaak van toepassing is",null,null,null,"aantal clienten bij wie aanpasbaar hoog-laag systeem is gebruikt (elektrisch, mechanisch)",null,null,null,"aantal clienten bij wie een hulpmiddel (rolbord, plafondlift, passieve lift, zweefmatras...) wordt gebruikt",null,null,null,"% clienten bij wie aanpasbaar hoog-laag systeem is gebruikt (elektrisch, mechanisch)",null,null,null,"% clienten bij wie een hulpmiddel (rolbord, plafondlift, passieve lift, zweefmatras...) wordt gebruikt",null,null,null,"Zorgzwaarte (percentage clienten in Mobiliteitsklasse B,C,D en E)"]
[null,null,"A",null,null,{"$f":"'detail transfer'!F54","v":0}]
[]
[]
[null,null,"B",null,null,{"$f":"'detail transfer'!F55","v":0},null,null,null,{"$f":"'detail transfer'!G55","v":0},null,null,null,null,null,null,null,{"$f":"IF($F17=0,\"---\",J17/$F17)","v":"---"},null,null,null,null,null,null,{"$f":"IF($G$8=0,\"---\",(F17+F20+F23+F26)/$G$8)","v":"---"}]
[]
[]
[null,null,"C",null,null,{"$f":"'detail transfer'!F56","v":0},null,null,null,{"$f":"'detail transfer'!G56","v":0},null,null,null,{"$f":"+'detail transfer'!H56","v":0},null,null,null,{"$f":"IF($F20=0,\"---\",J20/$F20)","v":"---"},null,null,null,{"$f":"IF($F20=0,\"---\",N20/$F20)","v":"---"}]
[]
[]
[null,null,"D",null,null,{"$f":"'detail transfer'!F57","v":0},null,null,null,{"$f":"'detail transfer'!G57","v":0},null,null,null,{"$f":"'detail transfer'!H57","v":0},null,null,null,{"$f":"IF($F23=0,\"---\",J23/$F23)","v":"---"},null,null,null,{"$f":"IF($F23=0,\"---\",N23/$F23)","v":"---"}]
[]
[]
[null,null,"E",null,null,{"$f":"'detail transfer'!F58","v":0},null,null,null,{"$f":"'detail transfer'!G58","v":0},null,null,null,{"$f":"'detail transfer'!H58","v":0},null,null,null,{"$f":"IF($F26=0,\"---\",J26/$F26)","v":"---"},null,null,null,{"$f":"IF($F26=0,\"---\",N26/$F26)","v":"---"}]
[]
[]
[]
[2,"Transfers binnen het bed (hogerop, wentelen, translatie in bed)","mobiliteit van de client",null,"aantal clienten op wie de zorgtaak van toepassing is",null,null,null,"aantal clienten bij wie  een (elektrisch) hoog-laagbed aanwezig is",null,null,null,"aantal clienten bij wie een hulpmiddel (glijlaken/zeil, plafondlift, passieve lift, zweefmatras...) wordt gebruikt",null,null,null,"% clienten bij wie een (elektrisch) hoog-laagbed aanwezig is",null,null,null,"% clienten bij wie een hulpmiddel (glijlaken/zeil, plafondlift, passieve lift, zweefmatras...) wordt gebruikt",null,null,null,"Zorgzwaarte (percentage clienten in Mobiliteitsklasse B,C,D en E)"]
[null,null,"A",null,null,{"$f":"'detail transfer'!I54","v":0}]
[]
[]
[null,null,"B",null,null,{"$f":"'detail transfer'!I55","v":0},null,null,null,{"$f":"'detail transfer'!J55","v":0},null,null,null,null,null,null,null,{"$f":"IF($F34=0,\"---\",J34/$F34)","v":"---"},null,null,null,null,null,null,{"$f":"IF($G$8=0,\"---\",(F34+F37+F40+F43)/$G$8)","v":"---"}]
[]
[]
[null,null,"C",null,null,{"$f":"'detail transfer'!I56","v":0},null,null,null,{"$f":"'detail transfer'!J56","v":0},null,null,null,{"$f":"'detail transfer'!K56","v":0},null,null,null,{"$f":"IF($F37=0,\"---\",J37/$F37)","v":"---"},null,null,null,{"$f":"IF($F37=0,\"---\",N37/$F37)","v":"---"}]
[]
[]
[null,null,"D",null,null,{"$f":"'detail transfer'!I57","v":0},null,null,null,{"$f":"'detail transfer'!J57","v":0},null,null,null,{"$f":"'detail transfer'!K57","v":0},null,null,null,{"$f":"IF($F40=0,\"---\",J40/$F40)","v":"---"},null,null,null,{"$f":"IF($F40=0,\"---\",N40/$F40)","v":"---"}]
[]
[]
[null,null,"E",null,null,{"$f":"'detail transfer'!I58","v":0},null,null,null,{"$f":"'detail transfer'!J58","v":0},null,null,null,{"$f":"'detail transfer'!K58","v":0},null,null,null,{"$f":"IF($F43=0,\"---\",J43/$F43)","v":"---"},null,null,null,{"$f":"IF($F43=0,\"---\",N43/$F43)","v":"---"}]
[]
[]
[]
[3,"Transfers van en naar bed, (rol)stoel etc (lig - zit) ","mobiliteit van de client",null,"aantal clienten op wie de zorgtaak van toepassing is",null,null,null,"aantal clienten bij  wie een hulpmiddel voor staan wordt gebruikt (zie comment)",null,null,null,"aantal clienten bij wie een passieve lift, plafondlift, ... wordt gebruikt",null,null,null,"% clienten bij  wie een hulpmiddel voor staan wordt gebruikt",null,null,null,"% clienten bij wie een passieve lift, plafondlift, ... wordt gebruikt",null,null,null,"Zorgzwaarte (percentage clienten in Mobiliteitsklasse C,D en E)"]
[null,null,"A",null,null,{"$f":"'detail transfer'!L54","v":0}]
[]
[]
[null,null,"B",null,null,{"$f":"'detail transfer'!L55","v":0}]
[]
[]
[null,null,"C",null,null,{"$f":"'detail transfer'!L56","v":0},null,null,null,{"$f":"'detail transfer'!M56","v":0},null,null,null,null,null,null,null,{"$f":"IF($F54=0,\"---\",J54/$F54)","v":"---"},null,null,null,null,null,null,{"$f":"IF($G$8=0,\"---\",(F54+F57+F60)/$G$8)","v":"---"}]
[]
[]
[null,null,"D",null,null,{"$f":"'detail transfer'!L57","v":0},null,null,null,null,null,null,null,{"$f":"'detail transfer'!N57","v":0},null,null,null,null,null,null,null,{"$f":"IF($F57=0,\"---\",N57/$F57)","v":"---"}]
[]
[]
[null,null,"E",null,null,{"$f":"'detail transfer'!L58","v":0},null,null,null,null,null,null,null,{"$f":"'detail transfer'!N58","v":0},null,null,null,null,null,null,null,{"$f":"IF($F60=0,\"---\",N60/$F60)","v":"---"}]
[]
[]
[]
[]
[4,"Steunkousen",null,null,"aantal clienten op wie de zorgtaak van toepassing is",null,null,null,null,"aantal clienten bij wie een goed steunkoushulpmiddel wordt gebruikt",null,null,null,null,null,null,null,"% clienten bij wie een goed steunkoushulpmiddel kan worden gebruikt",null,null,null,null,null,null,"Zorgzwaarte"]
[null,null,null,null,null,{"$f":"'detail wasgebeuren'!D53","v":0},null,null,null,null,null,null,null,{"$f":"'detail wasgebeuren'!E53","v":0},null,null,null,null,null,null,null,{"$f":"IF($F66=0,\"---\",N66/$F66)","v":"---"},null,null,{"$f":"IF($G$8=0,\"---\",F66/$G$8)","v":"---"}]
[]
[]
[]
[5,"Douchen of wassen zittende client ",null,null,"aantal clienten op wie de zorgtaak van toepassing is",null,null,null,null,null,"aantal clienten bij wie een hoog-laag douchestoel wordt gebruikt",null,null,null,null,null,null,null,"% clienten bij wie een hoog-laag douchestoel wordt gebruikt",null,null,null,null,null,"Zorgzwaarte"]
[null,null,null,null,null,{"$f":"'detail wasgebeuren'!F53","v":0},null,null,null,null,null,null,null,{"$f":"'detail wasgebeuren'!G53","v":0},null,null,null,null,null,null,null,{"$f":"IF($F71=0,\"---\",N71/$F71)","v":"---"},null,null,{"$f":"IF($G$8=0,\"---\",F71/$G$8)","v":"---"}]
[]
[]
[]
[6,"Douchen liggende client ",null,null,"aantal clienten op wie de zorgtaak van toepassing is",null,null,null,null,null,"aantal clienten bij wie een hoog-laag douchebrancard wordt gebruikt",null,null,null,null,null,null,"% clienten bij wie een hoog-laag douchebrancard wordt gebruikt",null,null,null,null,null,null,"Zorgzwaarte"]
[null,null,null,null,null,{"$f":"'detail wasgebeuren'!H53","v":0},null,null,null,null,null,null,null,{"$f":"'detail wasgebeuren'!I53","v":0},null,null,null,null,null,null,null,{"$f":"IF($F76=0,\"---\",N76/$F76)","v":"---"},null,null,{"$f":"IF($G$8=0,\"---\",F76/$G$8)","v":"---"}]
[]
[]
[]
[7,"Verplaatsing van zit naar sta en stappen\nmerk op: reken enkel de cliënten B en C",null,null,"aantal clienten op wie de zorgtaak van toepassing is",null,null,null,null,"aantal clienten waarvoor een geschikt hulpmiddel (kruk, looprek,rollator, wandelstok) aanwezig is",null,null,null,null,null,null,null,"% clienten bij wie een geschikt hulpmiddel (aciteve lift, opstahulp, hoogte bed, zetel die kan kantelen, ..) aanwezig is",null,null,null,null,null,null,"Zorgzwaarte"]
[null,null,null,null,null,{"$f":"SUM('detail transfer'!O55:O56)","v":0},null,null,null,null,null,null,null,{"$f":"SUM('detail transfer'!P55:P56)","v":0},null,null,null,null,null,null,null,{"$f":"IF($F81=0,\"---\",N81/$F81)","v":"---"},null,null,{"$f":"IF($G$8=0,\"---\",F81/$G$8)","v":"---"}]
[]
[]
[]
[8,"Baden client",null,null,"aantal clienten op wie de zorgtaak van toepassing is",null,null,null,null,null,null,"aantal clienten bij wie een hoog-laagbad of hoog-laag badstoel wordt gebruikt",null,null,null,null,null,null,"% clienten bij wie een hoog-laagbad of hoog-laag badstoel wordt gebruikt",null,null,null,null,null,"Zorgzwaarte"]
[null,null,null,null,null,{"$f":"'detail wasgebeuren'!J53","v":0},null,null,null,null,null,null,null,{"$f":"'detail wasgebeuren'!K60","v":0},null,null,null,null,null,null,null,{"$f":"IF($F86=0,\"---\",N86/$F86)","v":"---"},null,null,{"$f":"IF($G$8=0,\"---\",F86/$G$8)","v":"---"}]
[]
[]
[]
[5,"Het aantal aanwezige hulpmiddelen"]
[]
["a","Hoeveel verplaatsingsmiddelen (rolborden, glijzeilen, tilbanden e.d. zijn er aanwezig?",null,null,null,null,null,null,null,null,null,null,null,{"$f":"SUM('detail transfer'!G66:G71,'detail transfer'!G74,'detail transfer'!K69:K70)","v":0}]
[]
[]
["b","Hoeveel  hulpmiddelen van lig naar zit zijn aanwezig (uitz. actieve lift)?",null,null,null,null,null,null,null,null,null,null,null,{"$f":"SUM('detail transfer'!O67:O70)","v":0}]
[]
[]
["c","Hoeveel hoog-laag-douchestoelen zijn er aanwezig?",null,null,null,null,null,null,null,null,null,null,null,{"$f":"'detail transfer'!G79","v":0}]
[]
[]
["d","Hoeveel hoog-laag-douchebrancards zijn er aanwezig?",null,null,null,null,null,null,null,null,null,null,null,{"$f":"'detail transfer'!G81","v":0}]
[]
[]
["e","Hoeveel hoog-laag-baden zijn er aanwezig?",null,null,null,null,null,null,null,null,null,null,null,{"$f":"'detail transfer'!G80","v":0}]
[]
[]
["f","Hoeveel hoog-laag-bedden zijn er aanwezig?",null,null,null,null,null,null,null,null,null,null,null,{"$f":"'detail transfer'!G78","v":0}]
[]
[]
["g","Hoeveel sta- en staphulpmiddelen zijn er aanwezig?",null,null,null,null,null,null,null,null,null,null,null,{"$f":"'detail transfer'!K78","v":0}]
[]
[]
["h","Hoeveel tilliften zijn er aanwezig?",null,null,null,null,null,null,null,null,null,"actief",null,{"$f":"'detail transfer'!O66","v":0}]
[]
[]
[null,null,null,null,null,null,null,null,null,null,null,"passief",null,{"$f":"'detail transfer'!O74","v":0}]
[]
[]
[null,null,null,null,null,null,null,null,null,null,null,"plafond",null,{"$f":"'detail transfer'!O75","v":0}]
[]
[]
[]
[]
[]
["Auteurs:  Liddy Geuze, Nico Knibbe en Hanneke Knibbe (www.LOCOmotion.nu) en VerV. Bewerkt door Lieven Maertens, Filip Buckens en Johan Lamsens"]

{"sheet":"tabel","index":5,"n_rows":38,"n_cols":29,"rows_kept":38,"cut":false,"hidden":false,"merged":[[0,4,0,8],[1,4,1,8],[10,1,11,1],[0,0,0,3],[2,4,2,8],[1,0,1,3],[2,0,2,3],[6,2,7,2],[3,0,3,8],[6,1,7,1],[6,0,7,0],[4,4,4,8],[4,0,5,0],[4,1,5,1],[4,2,5,2],[4,3,5,3],[17,4,17,7],[8,2,9,2],[10,2,11,2],[8,0,9,0],[12,4,12,8],[16,4,16,7],[13,4,13,7],[14,4,14,7],[15,4,15,7],[10,0,11,0],[8,1,9,1]]}
["Overzicht van de resultaten van de TTM van locatie/afdeling/groep:",null,null,null,{"$f":"IF(Overzichtsblad!G6=0,\"---\",Overzichtsblad!G6)","v":"---"}]
["                                                                                    Instelling: ",null,null,null,{"$f":"IF(Overzichtsblad!G4=0,\"---\",Overzichtsblad!G4)","v":"---"},null,null,null,null,null,null,null,null,"hulptabel grafiek totaaloverzicht"]
["                                                                               Invuldatum:",null,null,null,{"$f":"IF(Overzichtsblad!U6=0,\"---\",Overzichtsblad!U6)","v":"2018-10-11"}]
[]
["Zorg- taak"," Omschrijving","Zorg- zwaarte","Hulpmiddelen (die volgens de Praktijkrichtlijnen Fysieke Belasting gebruikt zouden moeten worden)","% clienten bij wie de zorgtaken volgens de Praktijkrichtlijnen worden uitgevoerd. Als alles volgens de Praktijkrichtlijnen uitgevoerd zou zijn zou er overal 100% staan."]
[null,null,null,null,{"$f":"'detail transfer'!B54","v":0},{"$f":"'detail transfer'!B55","v":0},{"$f":"'detail transfer'!B56","v":0},{"$f":"'detail transfer'!B57","v":0},{"$f":"'detail transfer'!B58","v":0},null,null,null,null,"zorgtaak","zorgzwaarte B","conform PR B","niet conform PR B","zorgzwaarte C","Conform PR C","niet conform PR C","zorgzwaarte oranje","conform PR oranje","niet conform PR oranje","zorg-zwaarte rood","preventie rood","geen preventie rood","zorgzwaarte totaal","conform PR","niet conform PR"]
[1,"Transfers van lig naar lig",{"$f":"Overzichtsblad!Y17","v":"---"},"elektr hooglaagbed, hoog-laag brancard of elektr hoog-laag aankleedtafel ","nvt",{"$f":"Overzichtsblad!R17","v":"---"},{"$f":"Overzichtsblad!R20","v":"---"},{"$f":"Overzichtsblad!R23","v":"---"},{"$f":"Overzichtsblad!R26","v":"---"},null,null,null,1,"1. van lig naar lig (EHL)",{"$f":"Overzichtsblad!F17/Overzichtsblad!$G$8","v":{"$error":"#DIV/0!"}},{"$f":"IF(F7=\"---\",0%,F7*O7)","v":0},{"$f":"O7-P7","v":{"$error":"#DIV/0!"}},{"$f":"Overzichtsblad!F20/Overzichtsblad!$G$8","v":{"$error":"#DIV/0!"}},{"$f":"IF(G7=\"---\",0%,G7*R7)","v":0},{"$f":"R7-S7","v":{"$error":"#DIV/0!"}},{"$f":"Overzichtsblad!F23/Overzichtsblad!$G$8","v":{"$error":"#DIV/0!"}},{"$f":"IF(H7=\"---\",0%,H7*U7)","v":0},{"$f":"U7-V7","v":{"$error":"#DIV/0!"}},{"$f":"Overzichtsblad!F26/Overzichtsblad!$G$8","v":{"$error":"#DIV/0!"}},{"$f":"IF(I7=\"---\",0%,I7*X7)","v":0},{"$f":"X7-Y7","v":{"$error":"#DIV/0!"}},{"$f":"O7+R7+U7+X7","v":{"$error":"#DIV/0!"}},{"$f":"P7+S7+V7+Y7","v":0},{"$f":"Q7+T7+W7+Z7","v":{"$error":"#DIV/0!"}}]
[null,null,null,"glij/rolmateriaal","nvt","nvt",{"$f":"Overzichtsblad!V20","v":"---"},{"$f":"Overzichtsblad!V23","v":"---"},{"$f":"Overzichtsblad!V26","v":"---"},null,null,null,1,"1. van lig naar lig (glijzeil)",null,null,null,{"$f":"R7","v":{"$error":"#DIV/0!"}},{"$f":"IF(G8=\"---\",0%,G8*R8)","v":0},{"$f":"R8-S8","v":{"$error":"#DIV/0!"}},{"$f":"U7","v":{"$error":"#DIV/0!"}},{"$f":"IF(H8=\"---\",0%,H8*U8)","v":0},{"$f":"U8-V8","v":{"$error":"#DIV/0!"}},{"$f":"X7","v":{"$error":"#DIV/0!"}},{"$f":"IF(I8=\"---\",0%,I8*X8)","v":0},{"$f":"X8-Y8","v":{"$error":"#DIV/0!"}},{"$f":"O8+R8+U8+X8","v":{"$error":"#DIV/0!"}},{"$f":"P8+S8+V8+Y8","v":0},{"$f":"Q8+T8+W8+Z8","v":{"$error":"#DIV/0!"}}]
[2,"Transfers binnen de grenzen van de ligondersteuning",{"$f":"Overzichtsblad!Y34","v":"---"},"elektr hooglaagbed, hoog-laag brancard of elektr hoog-laag aankleedtafel ","nvt",{"$f":"Overzichtsblad!R34","v":"---"},{"$f":"Overzichtsblad!R37","v":"---"},{"$f":"Overzichtsblad!R40","v":"---"},{"$f":"Overzichtsblad!R43","v":"---"},null,null,null,2,"2. binnen grenzen ligondersteuning (EHL)",{"$f":"Overzichtsblad!F34/Overzichtsblad!$G$8","v":{"$error":"#DIV/0!"}},{"$f":"IF(F9=\"---\",0%,F9*O9)","v":0},{"$f":"O9-P9","v":{"$error":"#DIV/0!"}},{"$f":"Overzichtsblad!F37/Overzichtsblad!$G$8","v":{"$error":"#DIV/0!"}},{"$f":"IF(G9=\"---\",0%,G9*R9)","v":0},{"$f":"R9-S9","v":{"$error":"#DIV/0!"}},{"$f":"Overzichtsblad!F40/Overzichtsblad!$G$8","v":{"$error":"#DIV/0!"}},{"$f":"IF(H9=\"---\",0%,H9*U9)","v":0},{"$f":"U9-V9","v":{"$error":"#DIV/0!"}},{"$f":"Overzichtsblad!F43/Overzichtsblad!$G$8","v":{"$error":"#DIV/0!"}},{"$f":"IF(I9=\"---\",0%,I9*X9)","v":0},{"$error":"#DIV/0!"},{"$error":"#DIV/0!"},0,{"$error":"#DIV/0!"}]
[null,null,null,"glij/rolmateriaal","nvt","nvt",{"$f":"Overzichtsblad!V37","v":"---"},{"$f":"Overzichtsblad!V40","v":"---"},{"$f":"Overzichtsblad!V43","v":"---"},null,null,null,2,"2. binnen grenzen ligondersteuning (glijzeil)",null,null,null,{"$f":"R9","v":{"$error":"#DIV/0!"}},{"$f":"IF(G10=\"---\",0%,G10*R10)","v":0},{"$f":"R10-S10","v":{"$error":"#DIV/0!"}},{"$f":"U9","v":{"$error":"#DIV/0!"}},{"$f":"IF(H10=\"---\",0%,H10*U10)","v":0},{"$f":"U10-V10","v":{"$error":"#DIV/0!"}},{"$f":"X9","v":{"$error":"#DIV/0!"}},{"$f":"IF(I10=\"---\",0%,I10*X10)","v":0},{"$error":"#DIV/0!"},{"$error":"#DIV/0!"},0,{"$error":"#DIV/0!"}]
[3,"Transfers van en naar bed, (rol)stoel, toilet e.d.",{"$f":"Overzichtsblad!Y54","v":"---"},"stalift","nvt","nvt",{"$f":"Overzichtsblad!R54","v":"---"},"nvt","nvt",null,null,null,3,"3. van en naar bed (actieve lift)",null,null,null,{"$f":"Overzichtsblad!F54/Overzichtsblad!$G$8","v":{"$error":"#DIV/0!"}},{"$f":"IF(G11=\"---\",0%,G11*R11)","v":0},{"$f":"R11-S11","v":{"$error":"#DIV/0!"}},null,null,null,null,null,null,{"$error":"#DIV/0!"},0,{"$error":"#DIV/0!"}]
[null,null,null,"passieve lift","nvt","nvt","nvt",{"$f":"Overzichtsblad!V57","v":"---"},{"$f":"Overzichtsblad!V60","v":"---"},null,null,null,3,"3. van en naar bed (passieve lift)",null,null,null,null,null,null,{"$f":"Overzichtsblad!F57/Overzichtsblad!$G$8","v":{"$error":"#DIV/0!"}},{"$f":"IF(H12=\"---\",0%,H12*U12)","v":0},{"$f":"U12-V12","v":{"$error":"#DIV/0!"}},{"$f":"Overzichtsblad!F60/Overzichtsblad!$G$8","v":{"$error":"#DIV/0!"}},{"$f":"IF(I12=\"---\",0%,I12*X12)","v":0},{"$error":"#DIV/0!"},{"$error":"#DIV/0!"},0,{"$error":"#DIV/0!"}]
[null,null,null,null,"NB Voor de beoordeling van de zorgtaken 4a, 4b, 4c, 4d en 4e is de indeling in mobiliteitsklassen niet van belang."]
["4a","Steunkousen",{"$f":"Overzichtsblad!Y66","v":"---"},"Hulpmiddel voor steunkousen",null,null,null,null,{"$f":"Overzichtsblad!V66","v":"---"},null,null,null,"4a","4a. Begeleiden zitten-de client ",null,null,null,null,null,null,null,null,null,{"$f":"Overzichtsblad!F66/Overzichtsblad!$G$8","v":{"$error":"#DIV/0!"}},{"$f":"IF(I14=\"---\",0%,I14*X14)","v":0},{"$error":"#DIV/0!"},{"$error":"#DIV/0!"},0,{"$error":"#DIV/0!"}]
["4b","Douchen of wassen zittende client ",{"$f":"Overzichtsblad!Y71","v":"---"},"hoog-laag douchestoel",null,null,null,null,{"$f":"Overzichtsblad!V71","v":"---"},null,null,null,"4b","4b. Douchen/wassen zitten-de client ",null,null,null,null,null,null,null,null,null,{"$f":"Overzichtsblad!F71/Overzichtsblad!$G$8","v":{"$error":"#DIV/0!"}},{"$f":"IF(I15=\"---\",0%,I15*X15)","v":0},{"$error":"#DIV/0!"},{"$error":"#DIV/0!"},0,{"$error":"#DIV/0!"}]
["4c","Douchen liggende client",{"$f":"Overzichtsblad!Y76","v":"---"},"hoog-laag brancard",null,null,null,null,{"$f":"Overzichtsblad!V76","v":"---"},null,null,null,"4c","4c. Douchen liggende client ",null,null,null,null,null,null,null,null,null,{"$f":"Overzichtsblad!F76/Overzichtsblad!$G$8","v":{"$error":"#DIV/0!"}},{"$f":"IF(I16=\"---\",0%,I16*X16)","v":0},{"$error":"#DIV/0!"},{"$error":"#DIV/0!"},0,{"$error":"#DIV/0!"}]
["4d","Van zit naar staan (en wandelen)",{"$f":"Overzichtsblad!Y81","v":"---"},"nodige hulpmiddelen aanwezig voor zit-sta-wandelen",null,null,null,null,{"$f":"Overzichtsblad!V81","v":"---"},null,null,null,"4d","4d. Verzorgen liggende client",null,null,null,null,null,null,null,null,null,{"$f":"Overzichtsblad!F81/Overzichtsblad!$G$8","v":{"$error":"#DIV/0!"}},{"$f":"IF(I17=\"---\",0%,I17*X17)","v":0},{"$error":"#DIV/0!"},{"$error":"#DIV/0!"},0,{"$error":"#DIV/0!"}]
["4e","Baden client",{"$f":"Overzichtsblad!Y86","v":"---"},"hoog-laag bad of hoog-laag badstoel",null,null,null,null,{"$f":"Overzichtsblad!V86","v":"---"},null,null,null,"4e","4e. Baden client",null,null,null,null,null,null,null,null,null,{"$f":"Overzichtsblad!F86/Overzichtsblad!$G$8","v":{"$error":"#DIV/0!"}},{"$f":"IF(I18=\"---\",0%,I18*X18)","v":0},{"$error":"#DIV/0!"},{"$error":"#DIV/0!"},0,{"$error":"#DIV/0!"}]
[]
[null,null,null,null,null,null,null,null,null,null,null,null,null,"taak",null,null,null,"zorgzw C","zorgzw D","zorgzw E","totaal"]
[null,null,null,null,null,null,null,null,null,null,null,null,null,1,null,null,null,{"$f":"R7","v":{"$error":"#DIV/0!"}},{"$f":"U7","v":{"$error":"#DIV/0!"}},{"$f":"X7","v":{"$error":"#DIV/0!"}},{"$f":"R21+S21+T21","v":{"$error":"#DIV/0!"}}]
[null,null,null,null,null,null,null,null,null,null,null,null,null,2,null,null,null,{"$f":"R9","v":{"$error":"#DIV/0!"}},{"$f":"U9","v":{"$error":"#DIV/0!"}},{"$f":"X9","v":{"$error":"#DIV/0!"}},{"$f":"R22+S22+T22","v":{"$error":"#DIV/0!"}}]
[null,null,null,null,null,null,null,null,null,null,null,null,null,3,null,null,null,{"$f":"R11","v":{"$error":"#DIV/0!"}},{"$f":"U12","v":{"$error":"#DIV/0!"}},{"$f":"X12","v":{"$error":"#DIV/0!"}},{"$error":"#DIV/0!"}]
[null,null,null,null,null,null,null,null,null,null,null,null,null,"4a",null,null,null,0,0,{"$f":"X14","v":{"$error":"#DIV/0!"}},{"$error":"#DIV/0!"}]
[null,null,null,null,null,null,null,null,null,null,null,null,null,"4b",null,null,null,0,0,{"$f":"X15","v":{"$error":"#DIV/0!"}},{"$error":"#DIV/0!"}]
[null,null,null,null,null,null,null,null,null,null,null,null,null,"4c",null,null,null,0,0,{"$f":"X16","v":{"$error":"#DIV/0!"}},{"$error":"#DIV/0!"}]
[null,null,null,null,null,null,null,null,null,null,null,null,null,"4d",null,null,null,0,0,{"$f":"X17","v":{"$error":"#DIV/0!"}},{"$error":"#DIV/0!"}]
[null,null,null,null,null,null,null,null,null,null,null,null,null,"4e",null,null,null,0,0,{"$f":"X18","v":{"$error":"#DIV/0!"}},{"$error":"#DIV/0!"}]
[]
[null,null,null,null,null,null,null,null,null,null,null,null,null,"taak",null,null,null,"zorgzw C","zorgzw D","zorgzw E"]
[null,null,null,null,null,null,null,null,null,null,null,null,null,1]
[null,null,null,null,null,null,null,null,null,null,null,null,null,2]
[null,null,null,null,null,null,null,null,null,null,null,null,null,3]
[null,null,null,null,null,null,null,null,null,null,null,null,null,"4a"]
[null,null,null,null,null,null,null,null,null,null,null,null,null,"4b"]
[null,null,null,null,null,null,null,null,null,null,null,null,null,"4c"]
[null,null,null,null,null,null,null,null,null,null,null,null,null,"4d"]
[null,null,null,null,null,null,null,null,null,null,null,null,null,"4e"]

{"sheet":"grafiek","index":6,"n_rows":54,"n_cols":13,"rows_kept":54,"cut":false,"hidden":false,"merged":[[0,17,60,17],[16,0,49,16],[50,0,50,1],[4,0,15,16],[2,2,2,16],[3,2,3,16],[50,13,53,16],[1,0,1,1],[1,2,1,16],[0,0,0,16],[54,0,60,16]]}
["Grafiek met de resultaten van de TTM van :"]
["Locatie/afdeling/groep",null,{"$f":"IF(Overzichtsblad!G6=0,\"---\",Overzichtsblad!G6)","v":"---"}]
["Instelling",null,{"$f":"IF(Overzichtsblad!G4=0,\"---\",Overzichtsblad!G4)","v":"---"}]
["invuldatum",null,{"$f":"IF(Overzichtsblad!U6=0,\"---\",Overzichtsblad!U6)","v":"2018-10-11"}]
[]
[]
[]
[]
[]
[]
[]
[]
[]
[]
[]
[]
[]
[]
[]
[]
[]
[]
[]
[]
[]
[]
[]
[]
[]
[]
[]
[]
[]
[]
[]
[]
[]
[]
[]
[]
[]
[]
[]
[]
[]
[]
[]
[]
[]
[]
[null,null,"1. van lig naar lig (EHL)","1. van lig naar lig (glijzeil)","2. binnen grenzen ligonder-steuning (EHL)","2. binnen grenzen ligonder-steuning (glijzeil)","3. van en naar bed (actieve lift)","3. van en naar bed (passieve lift)","4, steun-kousen","5, douchen of wassen zittende client ","6. douchen liggende client ","7, zit naar sta - wandelen","8 baden client"]
[null,"deel zorgzwaarte volgens praktijkrichtlijnen",{"$f":"tabel!AB7","v":0},{"$f":"tabel!AB8","v":0},{"$f":"tabel!AB9","v":0},{"$f":"tabel!AB10","v":0},{"$f":"tabel!AB11","v":0},{"$f":"tabel!AB12","v":0},{"$f":"tabel!AB14","v":0},{"$f":"tabel!AB15","v":0},{"$f":"tabel!AB16","v":0},{"$f":"tabel!AB17","v":0},{"$f":"tabel!AB18","v":0}]
[null,"deel zorgzwaarte niet volgens praktijkrichtlijnen",{"$f":"tabel!AC7","v":{"$error":"#DIV/0!"}},{"$f":"tabel!AC8","v":{"$error":"#DIV/0!"}},{"$f":"tabel!AC9","v":{"$error":"#DIV/0!"}},{"$f":"tabel!AC10","v":{"$error":"#DIV/0!"}},{"$f":"tabel!AC11","v":{"$error":"#DIV/0!"}},{"$f":"tabel!AC12","v":{"$error":"#DIV/0!"}},{"$f":"tabel!AC14","v":{"$error":"#DIV/0!"}},{"$f":"tabel!AC15","v":{"$error":"#DIV/0!"}},{"$f":"tabel!AC16","v":{"$error":"#DIV/0!"}},{"$f":"tabel!AC17","v":{"$error":"#DIV/0!"}},{"$f":"tabel!AC18","v":{"$error":"#DIV/0!"}}]
[null,"totale zorgzwaarte",{"$f":"C52+C53","v":{"$error":"#DIV/0!"}},{"$f":"D52+D53","v":{"$error":"#DIV/0!"}},{"$error":"#DIV/0!"},{"$error":"#DIV/0!"},{"$error":"#DIV/0!"},{"$error":"#DIV/0!"},{"$error":"#DIV/0!"},{"$error":"#DIV/0!"},{"$error":"#DIV/0!"},{"$error":"#DIV/0!"},{"$error":"#DIV/0!"}]

{"sheet":"praktijkrichtlijn","index":7,"n_rows":61,"n_cols":1,"rows_kept":61,"cut":false,"hidden":false,"merged":[[59,0,59,9]]}
["Praktijkrichtlijnen fysieke belasting "]
[]
[]
[]
[]
[]
[]
[]
[]
[]
[]
[]
[]
[]
[]
[]
[]
[]
[]
[]
[]
[]
[]
[]
[]
[]
[]
[]
[]
[]
[]
[]
[]
[]
[]
[]
[]
[]
[]
[]
[]
[]
[]
[]
[]
[]
[]
[]
[]
[]
[]
[]
[]
[]
[]
[]
[]
["NB    Afspraken rond het gebruik van tilliften moeten altijd individueel zijn vastgelegd in het zorgdossier (zie ook www.igz.nl)"]
["*    Andere effectieve oplossingen waarbij de fysieke belasting aantoonbaar binnen de normen valt genoemd in het schema zijn ook toegestaan."]
["** Wanneer het gaat om een transfer in lig van bed naar lig op bijv. douchebrancard, mag deze transfer ook uitgevoerd worden met de grote maat glij- of rol-materiaal. De cliënt moet daar dan helemaal op kunnen liggen. Wel moeten daarbij strikte veiligheidsmaatregelen in acht worden genomen. Hoewel er bij deze handeling dus fysieke belasting toelaatbaar is, gaat het hier nadrukkelijk om een minder veilige optie, waartoe dan ook alleen in onderling overleg besloten mag worden; het besluit moet in het zorgdossier worden vastgelegd."]
["*** Voor meer informatie over de mobiliteitsklasses zie Consensustekst VerV praktijkrichtlijnen zorg of via www.VerV.be "]

{"sheet":"zelfredzaamheid","index":8,"n_rows":51,"n_cols":1,"rows_kept":51,"cut":false,"hidden":false,"merged":[]}
[]
[]
[]
[]
[]
[]
[]
[]
[]
[]
[]
[]
[]
[]
[]
[]
[]
[]
[]
[]
[]
[]
[]
[]
[]
[]
[]
[]
[]
[]
[]
[]
[]
[]
[]
[]
[]
[]
[]
[]
[]
[]
[]
[]
[]
[]
[]
[]
[]
[]
["Verdere informatie is tevens terug te vinden via www.VerV.be en www.ergonomiesite.be "]